setup
checks.aarch64-darwin.tests
· build #28
· raw
1these 2 derivations will be built:2 /nix/store/sjrclfmk4jcdcniqqwy1xiw5z3kca014-cargo-vendor-dir.drv3 /nix/store/2qp38a4qid2lclfy8wqpf62yjla9c9gz-horae-tests-0.1.0.drv4error: build of '/nix/store/2qp38a4qid2lclfy8wqpf62yjla9c9gz-horae-tests-0.1.0.drv' on 'grpc://farm.numtide.com:50051?client-cert=/run/secrets/vars/per-machine/bld1/nix-farm-ci/crt&client-key=/run/secrets/vars/per-machine/bld1/nix-farm-ci/key&connect-timeout=22&system=aarch64-darwin' failed: Cannot build '/nix/store/2qp38a4qid2lclfy8wqpf62yjla9c9gz-horae-tests-0.1.0.drv'.5 Reason: builder failed with exit code 101.6 Output paths:7 /nix/store/wlisi9m8km04x9qzjj2jnwywxfqx4q3m-horae-tests-0.1.08 Last 25 log lines:9 > test server_fns::users::tests::hide_rates_clears_both_rate_fields ... ok10 > test server_fns::time_entries::update_tests::task_grants_allow_tracking_and_archived_history_for_every_role ... ok11 > test server_fns::reports::tests::shared_person_and_task_are_partitioned_by_currency ... ok12 > test server_fns::users::tests::concurrency::demotion_and_deactivation_keep_an_active_admin ... ok13 > test server_fns::users::tests::concurrency::the_last_admin_cannot_be_demoted_or_deactivated ... ok14 > test server_fns::users::tests::concurrency::unchanged_admin_access_is_allowed ... ok15 >16 > failures:17 >18 > ---- importers::harvest::engine_tests::completed_imports_allow_immediate_retries stdout ----19 >20 > thread 'importers::harvest::engine_tests::completed_imports_allow_immediate_retries' (88679873) panicked at crates/horae/src/importers/harvest/engine_tests.rs:133:14:21 > called `Result::unwrap()` on an `Err` value: error communicating with database: Socket is not connected (os error 57)22 >23 > Caused by:24 > Socket is not connected (os error 57)25 > note: run with `RUST_BACKTRACE=1` environment variable to display a backtrace26 >27 >28 > failures:29 > importers::harvest::engine_tests::completed_imports_allow_immediate_retries30 >31 > test result: FAILED. 820 passed; 1 failed; 10 ignored; 0 measured; 0 filtered out; finished in 68.70s32 >33 > error: test failed, to rerun pass `-p horae --bin horae`34 For full logs, run:35 nix log /nix/store/2qp38a4qid2lclfy8wqpf62yjla9c9gz-horae-tests-0.1.0.drv36error: Cannot build '/nix/store/2qp38a4qid2lclfy8wqpf62yjla9c9gz-horae-tests-0.1.0.drv'.37 Reason: builder failed with exit code 1.38 Output paths:39 /nix/store/wlisi9m8km04x9qzjj2jnwywxfqx4q3m-horae-tests-0.1.0