nixbot

builds

failed horae-tests-0.1.0 checks.aarch64-linux.tests · build #251 · raw

1elastic-arm-779dd3ca: building hagy9aljyawrd2ylv1f1caf7a8v5j34d-horae-tests-0.1.0.drv
unpackPhase
2unpacking source archive /nix/store/lbnpqfgv09vdm8fh0qsn3r99wx98d8vy-source3source root is source
patchPhase
4Executing configureCargoCommonVars5decompressing cargo artifacts from /nix/store/iz15gsb1vnxn8iiqaks5c263ms6mxl74-horae-checks-deps-0.1.0/target.tar.zst to target
configurePhase
6will append /build/source/.cargo-home/config.toml with contents of /nix/store/kqxgprj432hnlh0pqlk1779vyabfmw4i-vendor-cargo-deps/config.toml7default configurePhase, nothing to do
buildPhase
8+++ command cargo nextest run -p horae-core9 Compiling proc-macro2 v1.0.10610 Compiling serde_core v1.0.22811 Compiling serde v1.0.22812 Compiling num-traits v0.2.1913 Compiling quote v1.0.4614 Compiling syn v2.0.11815 Compiling uuid v1.23.416 Compiling serde_derive v1.0.22817 Compiling thiserror-impl v2.0.1818 Compiling thiserror v2.0.1819 Compiling chrono v0.4.4520 Compiling horae-core v0.1.0 (/build/source/crates/core)21 Finished `test` profile [unoptimized + debuginfo] target(s) in 9.05s22------------23 Nextest run ID 19c1edbc-a82b-4be4-bc07-04797e181e6c with nextest profile: default24 Starting 121 tests across 1 binary25 Running [ 00:00:00] 0/121: 8 running, 0 passed, 0 skipped 26 [ 00:00:00] horae-core ed_alert_threshold_is_exact_without_rounding27 [ 00:00:00] horae-core ert_accepts_zero_percent_but_not_zero_budget28 [ 00:00:00] horae-core ::a_single_jump_announces_every_crossed_band29 [ 00:00:00] horae-core jects_invalid_inputs_and_widens_large_values30 [ 00:00:00] horae-core percentage_rounds_clamps_and_never_overflows31 [ 00:00:00] horae-core ::tests::current_band_is_the_highest_reached32 [ 00:00:00] horae-core elow_a_band_does_not_fire_but_current_resets33 Running [ 00:00:00] ==> 39/121: 8 running, 39 passed, 0 skipped 34 [ 00:00:00] horae-core s::conversion_matches_exact_scaled_rationals35 [ 00:00:00] horae-core :hours_round_trip_against_exporter_transform36 [ 00:00:00] horae-core ert::tests::leading_and_trailing_forms_parse37 [ 00:00:00] horae-core t::tests::money_rounds_third_decimal_half_up38 [ 00:00:00] horae-core arvest::convert::tests::negative_is_rejected39 [ 00:00:00] horae-core onvert::tests::round_half_up_at_the_boundary40 [ 00:00:00] horae-core ::tests::composite_components_do_not_collide41 PASS [ 0.007s] horae-core budget::tests::configured_alert_rejects_invalid_inputs_and_widens_large_values42 PASS [ 0.007s] horae-core budget::tests::configured_alert_accepts_zero_percent_but_not_zero_budget43 PASS [ 0.007s] horae-core budget::tests::each_crossing_is_announced_once44 PASS [ 0.010s] horae-core budget::tests::drop_below_a_band_does_not_fire_but_current_resets45 PASS [ 0.010s] horae-core budget::tests::configured_alert_threshold_is_exact_without_rounding46 PASS [ 0.010s] horae-core budget::tests::display_percentage_rounds_clamps_and_never_overflows47 PASS [ 0.010s] horae-core budget::tests::current_band_is_the_highest_reached48 PASS [ 0.012s] horae-core budget::tests::a_single_jump_announces_every_crossed_band49 PASS [ 0.006s] horae-core budget::tests::large_values_do_not_overflow50 PASS [ 0.007s] horae-core budget::tests::no_band_for_zero_or_missing_budget51 PASS [ 0.005s] horae-core client::tests::profile_accepts_supported_currencies_and_unicode_character_limit52 PASS [ 0.008s] horae-core client::tests::optional_text_normalizes_only_blank_fields53 PASS [ 0.008s] horae-core client::tests::default_rate_rejects_negative_fractional_cent_overflow_and_invalid_text54 PASS [ 0.011s] horae-core budget::tests::over_budget_fires_even_without_a_configured_100_band55 PASS [ 0.007s] horae-core client::tests::profile_rejects_blank_overlong_and_null_names56 PASS [ 0.009s] horae-core client::tests::default_rate_preserves_absence_zero_and_exact_large_amounts57 PASS [ 0.005s] horae-core duration::tests::format_hhmm_pads_minutes58 PASS [ 0.007s] horae-core duration::tests::format_clamps_negative_to_zero59 PASS [ 0.011s] horae-core client::tests::profile_rejects_unsupported_currency_and_null_billing_fields60 PASS [ 0.005s] horae-core duration::tests::format_round_trip61 PASS [ 0.005s] horae-core duration::tests::parse_decimal62 PASS [ 0.008s] horae-core duration::tests::parse_colon63 PASS [ 0.006s] horae-core duration::tests::parse_rejects_colon_overflow_without_panicking64 PASS [ 0.004s] horae-core duration::tests::parse_rejects_excessive_decimal_precision_and_numerator65 PASS [ 0.010s] horae-core duration::tests::parse_preserves_u32_boundary_without_saturating66 PASS [ 0.012s] horae-core duration::tests::minutes_between_is_exact_no_minimum67 PASS [ 0.012s] horae-core duration::tests::parse_decimal_rounds_half_minutes_exactly68 Running [ 00:00:00] ==> 39/121: 8 running, 39 passed, 0 skipped 69 [ 00:00:00] horae-core s::conversion_matches_exact_scaled_rationals70 [ 00:00:00] horae-core :hours_round_trip_against_exporter_transform71 [ 00:00:00] horae-core ert::tests::leading_and_trailing_forms_parse72 [ 00:00:00] horae-core t::tests::money_rounds_third_decimal_half_up73 [ 00:00:00] horae-core arvest::convert::tests::negative_is_rejected74 [ 00:00:00] horae-core onvert::tests::round_half_up_at_the_boundary75 [ 00:00:00] horae-core ::tests::composite_components_do_not_collide76 PASS [ 0.008s] horae-core duration::tests::parse_rejects_negative_non_finite_and_malformed_values77 PASS [ 0.004s] horae-core importers::harvest::convert::tests::conversion_handles_high_precision_without_intermediate_overflow78 PASS [ 0.007s] horae-core importers::harvest::convert::tests::conversion_preserves_the_i64_boundary_and_rejects_rounding_past_it79 PASS [ 0.008s] horae-core importers::harvest::convert::tests::conversion_rejects_unrepresentable_scaled_values_without_panicking80 PASS [ 0.007s] horae-core importers::harvest::convert::tests::conversion_reports_precision_and_numerator_limits81 PASS [ 0.006s] horae-core importers::harvest::convert::tests::high_precision_fraction_straddles_the_half_minute_exactly82 PASS [ 0.013s] horae-core duration::tests::parse_round_trips_each_minute_in_a_day83 PASS [ 0.011s] horae-core importers::harvest::convert::tests::garbage_is_rejected84 PASS [ 0.005s] horae-core importers::harvest::convert::tests::money_round_trip_against_exporter_transform85 PASS [ 0.012s] horae-core importers::harvest::convert::tests::hours_common_values_are_exact86 PASS [ 0.008s] horae-core importers::harvest::convert::tests::money_common_values_are_exact87 PASS [ 0.004s] horae-core importers::harvest::keys::tests::client_key_equal_across_case_and_whitespace88 Running [ 00:00:00] ==> 39/121: 8 running, 39 passed, 0 skipped 89 [ 00:00:00] horae-core s::conversion_matches_exact_scaled_rationals90 [ 00:00:00] horae-core :hours_round_trip_against_exporter_transform91 [ 00:00:00] horae-core ert::tests::leading_and_trailing_forms_parse92 [ 00:00:00] horae-core t::tests::money_rounds_third_decimal_half_up93 [ 00:00:00] horae-core arvest::convert::tests::negative_is_rejected94 [ 00:00:00] horae-core onvert::tests::round_half_up_at_the_boundary95 [ 00:00:00] horae-core ::tests::composite_components_do_not_collide96 Running [ 00:00:00] ======> 81/121: 8 running, 39 passed, 0 skipped 97 [ 00:00:00] horae-core s::conversion_matches_exact_scaled_rationals98 [ 00:00:00] horae-core :hours_round_trip_against_exporter_transform99 [ 00:00:00] horae-core ert::tests::leading_and_trailing_forms_parse100 [ 00:00:00] horae-core t::tests::money_rounds_third_decimal_half_up101 [ 00:00:00] horae-core arvest::convert::tests::negative_is_rejected102 [ 00:00:00] horae-core onvert::tests::round_half_up_at_the_boundary103 [ 00:00:00] horae-core ::tests::composite_components_do_not_collide104 PASS [ 0.010s] horae-core importers::harvest::convert::tests::money_rounds_third_decimal_half_up105 PASS [ 0.008s] horae-core importers::harvest::convert::tests::round_half_up_at_the_boundary106 PASS [ 0.013s] horae-core importers::harvest::convert::tests::leading_and_trailing_forms_parse107 PASS [ 0.009s] horae-core importers::harvest::convert::tests::negative_is_rejected108 PASS [ 0.016s] horae-core importers::harvest::convert::tests::hours_round_trip_against_exporter_transform109 PASS [ 0.009s] horae-core importers::harvest::keys::tests::composite_components_do_not_collide110 PASS [ 0.010s] horae-core importers::harvest::keys::tests::normalize_matches_sql_harvest_norm_contract111 PASS [ 0.007s] horae-core importers::harvest::keys::tests::project_key_falls_back_to_client_and_name112 PASS [ 0.008s] horae-core importers::harvest::keys::tests::project_key_prefers_code_when_present113 PASS [ 0.009s] horae-core importers::harvest::keys::tests::occurrence_counter_keys_are_independent114 PASS [ 0.005s] horae-core importers::harvest::keys::tests::task_key_shared_across_projects115 PASS [ 0.012s] horae-core importers::harvest::keys::tests::occurrence_counter_numbers_repeats_from_zero116 PASS [ 0.005s] horae-core importers::harvest::keys::tests::time_entry_key_distinguishes_and_matches117 PASS [ 0.005s] horae-core importers::harvest::types::tests::import_modes_display_their_wire_names118 PASS [ 0.016s] horae-core importers::harvest::keys::tests::normalize_trims_and_case_folds119 PASS [ 0.008s] horae-core importers::harvest::types::account_switch_tests::account_switch_requires_binding_and_no_imports_or_active_work120 PASS [ 0.007s] horae-core importers::harvest::types::tests::archived_errors_and_new_inline_errors_reconcile_across_batches121 PASS [ 0.007s] horae-core importers::harvest::types::tests::does_not_reconcile_when_an_errored_count_has_no_reported_error122 PASS [ 0.005s] horae-core importers::harvest::types::tests::reconciles_when_errored_counts_match_collected_errors123 PASS [ 0.006s] horae-core invoice::tests::discount_allocation_handles_empty_zero_and_full_discounts124 PASS [ 0.007s] horae-core invoice::tests::discount_allocation_uses_largest_remainder_then_stable_source_order125 PASS [ 0.005s] horae-core invoice::tests::invoice_adjustments_apply_discount_before_non_compounding_taxes126 PASS [ 0.008s] horae-core invoice::tests::discount_allocation_supports_maximum_representable_subtotal127 PASS [ 0.009s] horae-core invoice::tests::discounted_fee_contribution_leaves_discount_available128 PASS [ 0.012s] horae-core invoice::tests::discount_allocation_rejects_negative_lines_and_subtotal_overflow129 Running [ 00:00:00] ======> 82/121: 8 running, 82 passed, 0 skipped 130 [ 00:00:00] horae-core s::conversion_matches_exact_scaled_rationals131 [ 00:00:00] horae-core addition_rejects_overflow_in_both_directions132 [ 00:00:00] horae-core rse_cents_is_exact_where_a_float_would_drift133 [ 00:00:00] horae-core rse_cents_reads_whole_and_fractional_amounts134 [ 00:00:00] horae-core parse_cents_rejects_what_it_cannot_represent135 [ 00:00:00] horae-core se_cents_tolerates_grouping_spaces_and_signs136 [ 00:00:00] horae-core cs_accept_same_day_but_reject_reversed_dates137 PASS [ 0.015s] horae-core invoice::tests::discount_allocation_conserves_header_amount_and_bounds_each_line138 PASS [ 0.007s] horae-core invoice::tests::invoice_adjustments_reject_negative_subtotal_and_overflow139 PASS [ 0.004s] horae-core invoice::tests::line_amount_exact_hour140 PASS [ 0.007s] horae-core invoice::tests::line_amount_90_minutes141 PASS [ 0.012s] horae-core invoice::tests::invoice_adjustments_round_components_half_up142 PASS [ 0.011s] horae-core invoice::tests::line_amount_accepts_large_representable_amounts143 PASS [ 0.005s] horae-core invoice::tests::line_amount_zero_minutes144 PASS [ 0.007s] horae-core invoice::tests::line_amount_rounds_half_cents_up_not_to_even145 PASS [ 0.012s] horae-core invoice::tests::line_amount_odd_minutes146 PASS [ 0.012s] horae-core invoice::tests::line_amount_rejects_unrepresentable_results147 PASS [ 0.012s] horae-core invoice::tests::line_amount_half_hour148 PASS [ 0.005s] horae-core invoice::tests::line_amount_zero_rate149 PASS [ 0.008s] horae-core invoice::tests::selected_rate_keeps_zero_and_explicit_missing_project_rate150 PASS [ 0.011s] horae-core invoice::tests::resolve_rate_cascade151 PASS [ 0.010s] horae-core invoice::tests::selected_rate_mode_ignores_unselected_rate_sources152 PASS [ 0.007s] horae-core money::tests::format_cents_groups_thousands_and_keeps_sign153 PASS [ 0.007s] horae-core money::tests::format_cents_plain_keeps_sign_below_one_unit154 PASS [ 0.009s] horae-core money::tests::addition_retains_currency_checks_and_representable_boundaries155 Running [ 00:00:00] ======> 82/121: 8 running, 82 passed, 0 skipped 156 [ 00:00:00] horae-core s::conversion_matches_exact_scaled_rationals157 [ 00:00:00] horae-core addition_rejects_overflow_in_both_directions158 [ 00:00:00] horae-core rse_cents_is_exact_where_a_float_would_drift159 [ 00:00:00] horae-core rse_cents_reads_whole_and_fractional_amounts160 [ 00:00:00] horae-core parse_cents_rejects_what_it_cannot_represent161 [ 00:00:00] horae-core se_cents_tolerates_grouping_spaces_and_signs162 [ 00:00:00] horae-core cs_accept_same_day_but_reject_reversed_dates163 PASS [ 0.006s] horae-core money::tests::parse_cents_tolerates_grouping_spaces_and_signs164 PASS [ 0.012s] horae-core money::tests::addition_rejects_overflow_in_both_directions165 PASS [ 0.007s] horae-core money::tests::parse_cents_rejects_what_it_cannot_represent166 PASS [ 0.010s] horae-core money::tests::parse_cents_is_exact_where_a_float_would_drift167 PASS [ 0.008s] horae-core money::tests::parse_cents_reads_whole_and_fractional_amounts168 PASS [ 0.007s] horae-core project::tests::basics_accept_same_day_but_reject_reversed_dates169 PASS [ 0.007s] horae-core project::tests::monthly_fee_dates_follow_calendar_months170 PASS [ 0.009s] horae-core project::tests::basics_reject_blank_and_overlong_names171 PASS [ 0.009s] horae-core project::tests::fee_schedules_reject_missing_overlong_and_excessive_milestones172 PASS [ 0.010s] horae-core project::tests::basics_reject_overlong_code_and_unsupported_currency173 PASS [ 0.013s] horae-core project::tests::basics_accept_supported_currencies_and_optional_dates174 PASS [ 0.086s] horae-core importers::harvest::convert::tests::conversion_matches_exact_scaled_rationals175 PASS [ 0.013s] horae-core project::tests::monetary_budgets_are_only_available_for_time_and_materials176 PASS [ 0.005s] horae-core project::tests::payment_terms_support_receipt_and_checked_days177 PASS [ 0.013s] horae-core project::tests::fee_schedules_validate_amounts_and_milestone_total178 PASS [ 0.007s] horae-core project::tests::percentage_preserves_exact_hundredths179 PASS [ 0.007s] horae-core rounding::tests::identity_when_inc_zero180 PASS [ 0.008s] horae-core project::tests::percentage_rejects_invalid_precision_range_and_syntax181 PASS [ 0.008s] horae-core rounding::tests::effective_minutes_respect_frozen_history_including_zero182 PASS [ 0.010s] horae-core project::tests::monthly_fee_dates_reject_invalid_calendar_inputs183 PASS [ 0.005s] horae-core rounding::tests::result_is_multiple_of_inc184 PASS [ 0.005s] horae-core rounding::tests::nearest_ties_round_up185 PASS [ 0.005s] horae-core state::tests::managers_invoice_open_and_approved_time186 PASS [ 0.005s] horae-core time_of_day::tests::clamp_to_day_prevents_crossing_midnight187 PASS [ 0.005s] horae-core time_of_day::tests::format_12h_matches_harvest_style188 PASS [ 0.005s] horae-core time_of_day::tests::format_round_trips189 PASS [ 0.006s] horae-core state::tests::only_manager_can_approve190 Running [ 00:00:00] ========= 121/121: 8 running, 82 passed, 0 skipped 191 [ 00:00:00] horae-core s::conversion_matches_exact_scaled_rationals192 [ 00:00:00] horae-core addition_rejects_overflow_in_both_directions193 [ 00:00:00] horae-core rse_cents_is_exact_where_a_float_would_drift194 [ 00:00:00] horae-core rse_cents_reads_whole_and_fractional_amounts195 [ 00:00:00] horae-core parse_cents_rejects_what_it_cannot_represent196 [ 00:00:00] horae-core se_cents_tolerates_grouping_spaces_and_signs197 [ 00:00:00] horae-core cs_accept_same_day_but_reject_reversed_dates198 PASS [ 0.005s] horae-core time_of_day::tests::parse_reads_12h_including_edges199 PASS [ 0.011s] horae-core state::tests::invoiced_is_final200 PASS [ 0.009s] horae-core state::tests::member_submit_and_reopen201 PASS [ 0.012s] horae-core rounding::tests::up_and_down202 PASS [ 0.005s] horae-core time_of_day::tests::parse_rejects_out_of_range_and_garbage203 PASS [ 0.005s] horae-core week::tests::configured_week_can_start_in_the_previous_year204 PASS [ 0.005s] horae-core week::tests::configured_week_reports_an_unrepresentable_start205 PASS [ 0.008s] horae-core time_of_day::tests::snap_rounds_to_nearest_step206 PASS [ 0.006s] horae-core week::tests::configured_week_contains_each_day_for_all_seven_start_days207 PASS [ 0.008s] horae-core types::tests::budget_kind_wire_strings_match_db_enum208 PASS [ 0.009s] horae-core time_of_day::tests::parse_reads_24h209 PASS [ 0.007s] horae-core week::tests::maps_any_weekday_to_its_monday210------------211 Summary [ 0.138s] 121 tests run: 121 passed, 0 skipped212 Running [ 00:00:00] ========= 121/121: 8 running, 82 passed, 0 skipped 213 [ 00:00:00] horae-core s::conversion_matches_exact_scaled_rationals214 [ 00:00:00] horae-core addition_rejects_overflow_in_both_directions215 [ 00:00:00] horae-core rse_cents_is_exact_where_a_float_would_drift216 [ 00:00:00] horae-core rse_cents_reads_whole_and_fractional_amounts217 [ 00:00:00] horae-core parse_cents_rejects_what_it_cannot_represent218 [ 00:00:00] horae-core se_cents_tolerates_grouping_spaces_and_signs219 [ 00:00:00] horae-core cs_accept_same_day_but_reject_reversed_dates220The files belonging to this database system will be owned by user "nixbld".221This user must also own the server process.222223The database cluster will be initialized with locale "C".224The default text search configuration will be set to "english".225226Data page checksums are disabled.227228fixing permissions on existing directory /build/tmp.2oA2BV79Xm ... ok229creating subdirectories ... ok230selecting dynamic shared memory implementation ... posix231selecting default "max_connections" ... 100232selecting default "shared_buffers" ... 128MB233selecting default time zone ... UTC234creating configuration files ... ok235running bootstrap script ... ok236performing post-bootstrap initialization ... ok237syncing data to disk ... ok238239initdb: warning: enabling "trust" authentication for local connections240initdb: hint: You can change this by editing pg_hba.conf or using the option -A, or --auth-local and --auth-host, the next time you run initdb.241242Success. You can now start the database server using:243244 pg_ctl -D /build/tmp.2oA2BV79Xm -l logfile start245246waiting for server to start.... done247server started248+++ command cargo test -p horae --features server249 Compiling horae v0.1.0 (/build/source/crates/horae)250 Compiling horae-core v0.1.0 (/build/source/crates/core)251 Finished `test` profile [unoptimized + debuginfo] target(s) in 4m 03s252 Running unittests src/main.rs (target/debug/deps/horae-28e72b71798c6b17)253254running 847 tests255test auth::oidc::tests::deactivated_subject_match_is_denied ... ok256test auth::oidc::tests::first_login_links_subject_via_verified_email ... ok257test auth::oidc::tests::deactivated_email_match_is_denied ... ok258test auth::oidc::tests::no_account_is_denied_not_provisioned ... ok259test auth::oidc::tests::subject_match_logs_in_without_relinking ... ok260test auth::oidc::tests::subject_match_takes_precedence_over_email ... ok261test auth::oidc::tests::extra_audiences_are_trusted_only_when_listed ... ok262test auth::oidc::tests::unverified_email_is_not_matched ... ok263test auth::page::tests::configured_label_is_html_escaped ... ok264test auth::page::tests::oidc_variant_uses_the_configured_label_and_hands_off_to_start ... ok265test auth::page::tests::dev_variant_offers_the_admin_bypass_and_no_fake_controls ... ok266test cli::imports::tests::api_submission_captures_generation_without_retrying_uncertain_acceptance ... ok267test cli::imports::tests::cancellation_racing_completion_does_not_claim_cancellation_was_requested ... ok268test cli::imports::tests::invalid_csv_files_fail_before_contacting_the_server ... ok269test cli::imports::tests::csv_named_pipe_is_rejected_without_waiting_for_a_writer ... ok270test cli::imports::tests::malformed_submission_acknowledgement_retains_its_request_identity ... ok271test cli::imports::tests::missing_session_is_a_structured_configuration_failure ... ok272test cli::imports::tests::missing_and_mismatched_jobs_fail_without_substitution ... ok273test cli::imports::tests::private_session_accepts_https_and_loopback_only ... ok274test cli::imports::tests::redirects_are_not_followed_or_exposed_as_server_error_text ... ok275test cli::imports::tests::archived_errors_publish_without_clobbering_and_preserve_the_prior_file_on_failure ... ok276test cli::imports::tests::retry_snapshot_is_compatible_with_missing_and_future_values ... ok277test cli::imports::tests::session_rejects_cookie_header_injection_without_echoing_the_value ... ok278test cli::imports::tests::session_rejects_plaintext_remote_and_credential_bearing_urls ... ok279test cli::imports::tests::session_rejects_public_permissions_and_symlinks ... ok280test cli::imports::tests::report_marks_confirmed_failed_outcomes_as_incomplete ... ok281test cli::imports::tests::ordinary_json_is_bounded_and_invalid_replies_are_not_echoed ... ok282test cli::imports::tests::status_and_wait_distinguish_failed_jobs_from_failed_reads ... ok283test cli::tests::default_command_rejects_invalid_environment_ports ... ok284test cli::tests::environment_probe ... ok285test cli::tests::remote_commands_reject_conflicting_or_unbounded_options ... ok286test cli::tests::default_command_uses_the_same_defaults_and_environment_as_serve ... ok287test cli::tests::remote_import_and_job_commands_accept_the_documented_arguments ... ok288test config::tests::dev_login_is_allowed_on_loopback ... ok289test config::tests::dev_login_is_refused_off_loopback ... ok290test config::tests::environment::environment_probe ... ok291test config::tests::environment::empty_environment_has_no_authentication_or_plugin_credentials ... ok292test config::tests::environment::example_environment_can_configure_all_required_oidc_and_harvest_fields ... ok293test config::tests::environment::job_attempt_limit_uses_the_documented_environment_variable ... ok294test config::tests::environment::invalid_job_attempt_limits_reject_startup ... ok295test config::tests::environment::obsolete_authentication_variables_do_not_configure_the_server ... ok296test config::tests::environment::partial_oidc_configuration_remains_disabled_without_a_callback ... ok297test config::tests::environment::mail_environment_requires_a_complete_valid_configuration ... ok298test config::tests::without_dev_login_any_bind_is_fine ... ok299test db::tests::pool_connections_force_custom_plans ... ok300test config::tests::environment::secure_cookies_use_the_documented_prefixed_variable ... ok301test auth::oidc::tests::linking::existing_subject_wins_over_another_accounts_email ... ok302test auth::oidc::tests::linking::different_subjects_cannot_both_claim_an_unlinked_account ... ok303test auth::oidc::tests::linking::deactivation_during_first_link_denies_login ... ok304test auth::oidc::tests::linking::simultaneous_logins_with_the_same_subject_are_allowed ... ok305test auth::oidc::tests::linking::unverified_email_cannot_link_an_account ... ok306test harvest::pagination_tests::harvest_own_time_omits_private_project_budget_metadata ... ok307test db::tests::reset_empties_the_database_and_reapplies_migrations ... ok308test harvest::pagination_tests::harvest_pagination_total_pages_does_not_overflow ... ok309test harvest::pagination_tests::harvest_pagination_catalog_links_preserve_filters_and_break_name_ties ... ok310test cli::imports::tests::wait_deadline_caps_a_pending_request_without_cancelling_the_job ... ok311test harvest::pagination_tests::harvest_pagination_malformed_filters_are_client_errors ... ok312test harvest::tests::a_manager_lists_users_with_their_rates ... ok313test harvest::pagination_tests::harvest_pagination_empty_and_out_of_range_pages_keep_the_contract ... ok314test harvest::tests::a_manager_sees_the_whole_org ... ok315test harvest::tests::a_member_cannot_fetch_a_colleagues_entry ... ok316test harvest::tests::a_member_cannot_filter_to_a_colleague ... ok317test harvest::pagination_tests::harvest_project_cost_overrides_require_admin_without_fabricated_fallback ... ok318test harvest::tests::a_member_cannot_list_users ... ok319test harvest::tests::a_member_sees_only_their_own_time_entries ... ok320test harvest::pagination_tests::harvest_pagination_rejects_invalid_windows_on_every_collection ... ok321test harvest::tests::harvest_effective_minutes_match_sql_for_open_and_frozen_time ... ok322test harvest::tests::harvest_entry_rates_respect_selected_project_mode ... ok323test harvest::tests::harvest_entry_rates_follow_the_cascade_and_frozen_invoice_line ... ok324test harvest::tests::page_window_defaults_and_checked_offsets ... ok325test harvest::tests::harvest_marks_unbilled_non_billable_contexts_consistently ... ok326test harvest::pagination_tests::harvest_pagination_router_preserves_session_and_tenant_guards ... ok327test harvest::tests::members_cannot_read_own_project_rates_or_cost_overrides ... ok328test importers::harvest::account_switch::tests::change_preserves_terminal_history_and_rejects_stale_confirmation ... ok329test importers::harvest::account_switch::tests::a_b_a_keeps_old_callbacks_requests_and_retries_fenced ... ok330test harvest::pagination_tests::harvest_project_progress_permissions_cover_counts_pages_and_details ... ok331test importers::harvest::account_switch::tests::competing_callbacks_and_confirmations_have_one_winner ... ok332test importers::harvest::account_switch::tests::competing_change_and_submission_cannot_both_succeed ... ok333test importers::harvest::account_switch::tests::queue_acceptance_does_not_wait_for_the_import_session_lock ... ok334test importers::harvest::account_switch::tests::disconnect_and_reconnect_fence_callbacks_but_not_same_account_work ... ok335test importers::harvest::api_source::http::tests::cancelled_backoff_does_not_wait_or_retry ... ok336test importers::harvest::api_source::http::tests::cursor_links_are_authoritative_even_with_null_or_stale_page_numbers ... ok337test importers::harvest::account_switch::tests::queued_work_and_provenance_block_without_changing_binding ... ok338test importers::harvest::api_source::http::tests::http_pages_follow_cursor_and_preserve_headers_and_encoded_filter ... ok339test importers::harvest::account_switch::tests::running_jobs_block_change_and_old_execution_never_reaches_http ... ok340test importers::harvest::api_source::http::tests::missing_next_cursor_is_not_silently_treated_as_completed ... ok341test importers::harvest::api_source::http::tests::pagination_cycle_detection_survives_restarting_after_every_page ... ok342test importers::harvest::api_source::http::tests::persisted_cursor_resumes_with_a_new_client_and_stays_complete_at_eof ... ok343test importers::harvest::api_source::http::tests::rejected_page_does_not_advance_the_cursor ... ok344test importers::harvest::api_source::http::tests::rejects_pagination_outside_the_authenticated_endpoint ... ok345test harvest::tests::imported_legacy_rates_survive_retry_in_harvest_list_and_detail ... ok346test importers::harvest::api_source::http::tests::resumed_cursor_rejects_untrusted_destinations_and_invalid_state_before_http ... ok347test importers::harvest::api_source::tests::assembled_rows_convert_to_exact_minutes ... ok348test importers::harvest::api_source::tests::assembles_rows_joining_parents_by_id ... ok349test importers::harvest::api_source::tests::hours_render_as_exact_decimals ... ok350test importers::harvest::api_source::tests::http_page_preserves_decimal_values_before_integer_conversion ... ok351test importers::harvest::api_source::tests::json_exponents_expand_exactly_with_bounded_output ... ok352test importers::harvest::account_switch::tests::successful_change_preserves_business_rows_and_failure_rolls_back_secrets ... ok353test importers::harvest::credentials::tests::bad_key_length_is_rejected ... ok354test importers::harvest::api_source::http::tests::http_retries_429_but_never_follows_redirects_or_shortens_long_backoff ... ok355test importers::harvest::account_switch::tests::retry_and_change_are_serialized ... ok356test importers::harvest::api_source::http::tests::http_rejects_oversized_malformed_and_cyclic_pages ... ok357test importers::harvest::credentials::tests::another_account_cannot_replace_credentials_or_watermarks ... ok358test importers::harvest::credentials::tests::decode_hex_rejects_bad_input ... ok359test importers::harvest::credentials::tests::concurrent_first_connections_cannot_bind_different_accounts ... ok360test importers::harvest::credentials::tests::encrypt_then_decrypt_round_trips ... ok361test harvest::pagination_tests::harvest_task_access_filters_counts_and_preserves_rate_free_history ... ok362test importers::harvest::api_source::http::tests::slow_consumer_backpressures_http_and_cancellation_stops_further_pages ... ok363test importers::harvest::credentials::tests::nonce_makes_ciphertext_nondeterministic ... ok364test importers::harvest::credentials::tests::connect_and_disconnect_share_import_exclusion_without_blocking_other_orgs ... ok365test importers::harvest::credentials::tests::connection_changes_work_with_a_single_connection_pool ... ok366test importers::harvest::credentials::tests::wrong_key_fails_to_decrypt ... ok367test importers::harvest::csv_source::tests::bad_date_becomes_a_row_error_not_a_rejection ... ok368test importers::harvest::csv_source::tests::conflicting_email_aliases_error_only_the_affected_row ... ok369test importers::harvest::csv_source::tests::csv_records_preserve_multiline_unicode_across_single_byte_reads ... ok370test importers::harvest::csv_source::tests::cursor_beyond_upload_is_rejected_without_parsing_rows ... ok371test importers::harvest::csv_source::tests::cursor_resumes_after_multiline_unicode_and_preserves_error_locations ... ok372test importers::harvest::csv_source::tests::delivers_a_row_before_reading_the_rest_of_the_file ... ok373test importers::harvest::csv_source::tests::empty_file_is_rejected ... ok374test importers::harvest::csv_source::tests::identity_columns_are_required_and_cannot_repeat ... ok375test importers::harvest::csv_source::tests::invalid_utf8_errors_one_record_and_continues ... ok376test importers::harvest::csv_source::tests::missing_required_columns_is_rejected ... ok377test importers::harvest::csv_source::tests::names_stay_separate_from_optional_email ... ok378test importers::harvest::csv_source::tests::parse_bool_accepts_yes_variants ... ok379test importers::harvest::csv_source::tests::parses_rows_case_insensitively ... ok380test importers::harvest::credentials::tests::disconnect_preserves_identity_and_provenance_for_the_original_account ... ok381test importers::harvest::credentials::tests::failed_credential_write_does_not_leave_an_account_binding ... ok382test importers::harvest::credentials::tests::unidentified_legacy_provenance_requires_operator_review ... ok383test importers::harvest::credentials::tests::same_account_reconnect_rotates_encryption_without_resetting_watermarks ... ok384test importers::harvest::credentials::tests::migration_binds_existing_connections_without_changing_secrets_or_markers ... ok385test importers::harvest::engine_tests::api_connection_checks_work_with_a_single_connection_pool ... ok386test importers::harvest::engine_tests::api_and_csv_share_the_lock_but_other_organizations_can_import ... ok387test importers::harvest::engine_tests::api_sync_adopts_entries_from_a_prior_csv_import ... ok388test harvest::pagination_tests::harvest_pagination_time_entries_keep_the_filtered_set_and_date_ties ... ok389test importers::harvest::engine_tests::bad_records_are_reported_and_run_continues ... ok390test importers::harvest::engine_tests::cancelled_http_waiter_keeps_the_lock_until_its_worker_exits ... ok391test importers::harvest::engine_tests::cancellation_rolls_back_rows_and_releases_the_import_session ... ok392test importers::harvest::engine_tests::csv_ambiguous_names_include_inactive_users_but_unique_email_disambiguates ... ok393test importers::harvest::engine_tests::concurrent_imports_reject_overlap_without_collapsing_repeated_entries ... ok394test importers::harvest::engine_tests::csv_malformed_file_is_rejected_with_no_writes ... ok395test importers::harvest::engine_tests::csv_import_populates_and_is_idempotent ... ok396test importers::harvest::engine_tests::csv_name_fallback_requires_a_full_unique_name_and_never_overrides_email ... ok397test importers::harvest::engine_tests::csv_name_only_dry_run_and_duplicate_occurrences_preserve_history ... ok398test importers::harvest::engine_tests::csv_streaming::cancelling_a_csv_waiting_for_more_bytes_releases_its_session ... ok399test importers::harvest::engine_tests::csv_name_only_matches_one_org_user_and_reimports_without_duplicates ... ok400test importers::harvest::engine_tests::csv_streaming::csv_applies_before_eof_but_transport_failure_rolls_back_everything ... ok401test importers::harvest::engine_tests::csv_streaming::csv_preview_errors_and_repeated_rows_match_commit_and_reimport ... ok402test importers::harvest::engine_tests::completed_imports_allow_immediate_retries ... ok403test importers::harvest::credentials::tests::completed_credential_changes_allow_immediate_retries ... ok404test importers::harvest::engine_tests::csv_streaming::csv_sql_backpressure_stops_reading_later_input_rows ... ok405test importers::harvest::engine_tests::csv_streaming::durable_csv_preview_crosses_batch_boundaries_without_committing_domain_data ... ok406test importers::harvest::engine_tests::csv_streaming::durable_csv_cancel_joins_parser_and_preserves_committed_rows ... ok407test importers::harvest::engine_tests::csv_streaming::durable_csv_preview_cancel_preserves_simulation_for_manual_retry ... ok408test importers::harvest::engine_tests::csv_streaming::durable_csv_cancel_preserves_its_completed_batches_for_manual_retry ... ok409test importers::harvest::engine_tests::csv_streaming::durable_csv_preview_resumes_after_a_crash_without_recounting_rows ... ok410test importers::harvest::engine_tests::csv_streaming::measure_csv_durable_100k ... ignored, 100,000-row durable CSV measurement; run explicitly with --release --nocapture411test importers::harvest::engine_tests::csv_streaming::measure_csv_durable_large_catalog_100k ... ignored, 100,000-row durable CSV with 5,000 parent sets; run explicitly with --release --nocapture412test importers::harvest::engine_tests::csv_streaming::measure_csv_streaming_100k ... ignored, 100,000-row CSV measurement; run explicitly with --release --nocapture413test importers::harvest::engine_tests::csv_streaming::measure_csv_streaming_large_catalog_100k ... ignored, 100,000-row CSV with 5,000 parent sets; run explicitly with --release --nocapture414test importers::harvest::engine_tests::csv_streaming::durable_csv_preview_rejects_a_stale_next_batch ... ok415test importers::harvest::engine_tests::csv_streaming::durable_csv_report_metadata_is_bounded_after_recovery ... ok416test importers::harvest::engine_tests::distinct_harvest_ids_with_identical_fields_import_as_two ... ok417test importers::harvest::engine_tests::csv_streaming::durable_csv_reclaimed_lease_cannot_commit_the_next_batch ... ok418test importers::harvest::engine_tests::csv_streaming::durable_csv_stale_commit_is_fenced_without_a_heartbeat ... ok419test importers::harvest::engine_tests::dry_run_writes_nothing_and_matches_commit ... ok420test importers::harvest::engine_tests::edited_entry_still_matched_by_provenance ... ok421test importers::harvest::engine_tests::failed_source_releases_the_session_and_rolls_back_partial_rows ... ok422test importers::harvest::engine_tests::import_rejects_ambiguous_normalized_email_without_partial_writes ... ok423test importers::harvest::engine_tests::lookup_cache::cold_query_callsite_on_untraced_thread_is_still_captured ... ok424test importers::harvest::engine_tests::lookup_cache::cached_email_and_full_name_do_not_share_a_namespace ... ok425test importers::harvest::engine_tests::full_import_creates_all_levels_with_exact_minutes ... ok426test importers::harvest::engine_tests::lookup_cache::cached_project_task_still_validates_each_rows_rate ... ok427test importers::harvest::engine_tests::lookup_cache::lookup_index_migration_preserves_existing_ambiguous_identities ... ok428test importers::harvest::engine_tests::lookup_cache::new_run_rechecks_previously_cached_user_for_ambiguity ... ok429test importers::harvest::engine_tests::lookup_cache::project_task_cache_distinguishes_both_sides_of_the_link ... ok430test importers::harvest::engine_tests::lookup_cache::rolled_back_row_does_not_cache_user_or_project_task ... ok431test importers::harvest::engine_tests::natural_key_reimport_normalizes_whitespace_and_ascii_case ... ok432test importers::harvest::engine_tests::overflowing_decimals_fail_only_their_rows ... ok433test importers::harvest::engine_tests::reimporting_identical_csv_rows_is_idempotent ... ok434test importers::harvest::engine_tests::second_identical_run_creates_nothing ... ok435test importers::harvest::engine_tests::submission_barrier_blocks_imported_time_entries ... ok436test importers::harvest::oauth::tests::authorize_url_carries_state_and_encoded_redirect ... ok437test importers::harvest::oauth::tests::authorize_url_preserves_query_values_without_injecting_parameters ... ok438test importers::harvest::oauth_callback_tests::account_policy_failures_return_safe_actionable_conflicts ... ok439test importers::harvest::oauth_callback_tests::mismatched_state_is_rejected_without_a_code ... ok440test importers::harvest::oauth_callback_tests::missing_returned_state_is_rejected ... ok441test importers::harvest::oauth_callback_tests::missing_stored_state_is_rejected ... ok442test importers::harvest::oauth_callback_tests::provider_error_is_rejected_before_exchange ... ok443test importers::harvest::oauth_callback_tests::valid_matching_state_yields_the_code ... ok444test importers::harvest::oauth_callback_tests::valid_state_but_missing_code_is_rejected ... ok445test importers::harvest::report::tests::archive_metadata_cannot_masquerade_as_a_legacy_or_inconsistent_report ... ok446test importers::harvest::report::tests::archived_report_round_trips_without_losing_error_accounting ... ok447test importers::harvest::report::tests::legacy_report_preserves_its_counts_and_error_details ... ok448test importers::harvest::report::tests::report_rejects_unsupported_and_invalid_versions ... ok449test importers::harvest::report::tests::serialized_report_has_a_supported_schema_version ... ok450test importers::harvest::resolve::checkpoint_tests::run_cache_round_trip_preserves_identity_namespaces_and_occurrences ... ok451test importers::harvest::engine_tests::csv_streaming::durable_csv_resumes_committed_batches_without_recounting_duplicate_rows ... ok452test importers::harvest::engine_tests::csv_streaming::csv_measurement_recovers_a_complete_batch_without_recounting ... ok453test importers::harvest::engine_tests::two_identical_csv_rows_import_as_two_entries ... ok454test importers::harvest::engine_tests::watermark_advances_only_on_commit ... ok455test importers::harvest::resolve::preview::tests::rejects_foreign_parent_snapshots_before_restoring_any_rows ... ok456test importers::harvest::resolve::preview::tests::checkpoint_restores_known_task_currency_and_keeps_old_currency_unknown ... ok457test importers::harvest::streaming::durable::preview::tests::restoration_omits_unneeded_virtual_entries ... ok458test importers::harvest::streaming::tests::api_planning_policy_ends_with_the_transaction ... ok459test importers::harvest::engine_tests::lookup_cache::repeated_rows_resolve_each_user_and_project_task_once ... ok460test importers::harvest::sync_tests::api_requires_email_even_when_full_name_matches ... ok461test importers::harvest::sync_tests::api_rejects_ambiguous_email_without_advancing_watermark ... ok462test importers::harvest::sync_tests::checkpoints::durable_api_cancellation_preserves_confirmed_pages_for_manual_retry ... ok463test importers::harvest::sync_tests::checkpoints::durable_api_preview_cancellation_preserves_confirmed_pages_for_manual_retry ... ok464test importers::harvest::sync_tests::checkpoints::durable_api_finalization_retry_does_not_repeat_completed_downloads ... ok465test importers::harvest::sync_tests::checkpoints::durable_api_preview_finalization_retry_does_not_repeat_completed_downloads ... ok466test importers::harvest::sync_tests::checkpoints::durable_api_preview_reclaimed_worker_cannot_checkpoint_its_next_page ... ok467test importers::harvest::engine_tests::large_run_reuses_parents_and_reconciles_totals ... ok468test importers::harvest::sync_tests::checkpoints::durable_api_preview_resume_preserves_row_errors ... ok469test importers::harvest::sync_tests::checkpoints::durable_api_preview_resumes_catalog_download ... ok470test importers::harvest::sync_tests::checkpoints::durable_api_preview_resumes_pages_without_publishing_domain_data ... ok471test importers::harvest::sync_tests::checkpoints::durable_api_resume_keeps_earlier_errors_and_does_not_advance_watermark ... ok472test importers::harvest::engine_tests::csv_streaming::durable_csv_preview_matches_existing_and_new_rows_with_one_connection ... ok473test importers::harvest::sync_tests::checkpoints::durable_api_reclaimed_worker_cannot_commit_its_next_page ... ok474test importers::harvest::sync_tests::checkpoints::durable_api_resume_remembers_an_earlier_missing_timestamp ... ok475test importers::harvest::sync_tests::checkpoints::durable_api_preview_resumes_after_a_confirmed_parent_batch ... ok476test importers::harvest::sync_tests::checkpoints::durable_api_preview_preserves_adoptions_and_repeated_ids_across_recovery ... ok477test importers::harvest::sync_tests::checkpoints::durable_api_resumes_a_partially_downloaded_catalog ... ok478test importers::harvest::sync_tests::disconnect_and_reconnect_preserves_imported_records_and_exact_identity ... ok479test importers::harvest::sync_tests::empty_sync_does_not_invent_a_watermark ... ok480test importers::harvest::sync_tests::dry_run_leaves_data_provenance_and_watermark_unchanged ... ok481test importers::harvest::sync_tests::checkpoints::failed_api_preview_publishes_its_last_confirmed_page_report ... ok482test importers::harvest::sync_tests::checkpoints::failed_api_commit_publishes_its_last_confirmed_page_report ... ok483test importers::harvest::sync_tests::checkpoints::durable_api_resumes_committed_pages_and_preserves_the_high_watermark ... ok484test importers::harvest::sync_tests::exact_api_decimals_survive_preview_commit_and_reimport ... ok485test importers::harvest::sync_tests::missing_client_fallback_and_failed_project_savepoints_do_not_poison_cache ... ok486test importers::harvest::sync_tests::failed_client_propagates_to_project_and_entry_without_placeholder_records ... ok487test importers::harvest::sync_tests::invalid_parent_blocks_dependent_time_but_other_catalog_records_survive ... ok488test importers::harvest::sync_tests::failed_rows_are_available_to_the_next_incremental_retry ... ok489test importers::harvest::sync_tests::missing_source_timestamp_keeps_the_previous_watermark ... ok490test importers::harvest::sync_tests::out_of_range_api_decimals_error_per_row_and_leave_retry_watermark ... ok491test importers::harvest::sync_tests::paging::cancelled_page_consumer_retains_lock_until_worker_exits_and_rolls_back ... ok492test importers::harvest::sync_tests::paging::durable_api_stale_commit_cannot_advance_data_or_watermark ... ok493test importers::harvest::sync_tests::paging::later_download_failure_rolls_back_parents_rows_and_watermark ... ok494test importers::harvest::sync_tests::scale::api_100k_commit_and_reimport ... ignored, 100,000-entry scale measurement; run explicitly with --release --nocapture495test importers::harvest::sync_tests::scale::api_100k_dry_run ... ignored, 100,000-entry scale measurement; run explicitly with --release --nocapture496test importers::harvest::sync_tests::scale::api_durable_100k_commit_and_reimport ... ignored, 100,000-entry durable API measurement; run explicitly with --release --nocapture497test importers::harvest::sync_tests::scale::api_durable_100k_dry_run ... ignored, 100,000-entry durable API measurement; run explicitly with --release --nocapture498test importers::harvest::sync_tests::parent_catalog_preserves_metadata_and_counts_each_entity_once ... ok499test importers::harvest::sync_tests::parent_only_api_import_creates_catalog_and_reimport_skips_it ... ok500test importers::harvest::sync_tests::checkpoints::durable_api_resumes_after_a_confirmed_parent_batch ... ok501test importers::harvest::sync_tests::parent_only_dry_run_previews_without_persisting_catalog ... ok502test importers::harvest::sync_tests::refreshed_tokens_survive_a_dry_run_rollback_in_the_same_import_session ... ok503test importers::harvest::sync_tests::watermark_never_passes_the_start_of_capture ... ok504test importers::harvest::sync_tests::successful_sync_only_marks_the_incrementally_fetched_entity ... ok505test importers::harvest::sync_tests::watermark_write_failure_rolls_back_imported_data ... ok506test init::tests::init_creates_one_org_and_one_admin_and_nothing_else ... ok507test init::tests::init_refuses_when_an_organization_exists ... ok508test jobs::outbox::tests::acknowledges_confirmed_delivery_without_reclaiming_it ... ok509test jobs::outbox::tests::invalid_payload_is_not_delivered_and_does_not_leak_into_errors ... ok510test importers::harvest::sync_tests::paging::invalid_and_missing_timestamp_rows_cross_page_boundaries_without_advancing ... ok511test jobs::outbox::tests::plugin_failure_retries_with_the_same_event_identity ... ok512test importers::harvest::sync_tests::paging::durable_api_cancel_waits_for_the_producer_before_acknowledging ... ok513test jobs::report::stream_tests::download_reports_missing_fragments_after_its_buffered_page ... ok514test jobs::report::stream_tests::download_reads_only_when_consumed_and_releases_its_connection ... ok515test importers::harvest::sync_tests::scale::http_pages_preview_commit_and_reimport ... ok516test jobs::report::tests::legacy_upgrade_preserves_job_states_and_existing_archives ... ok517test importers::harvest::sync_tests::scale::durable_measurement_finishes_from_its_eof_checkpoint ... ok518test jobs::tests::cancellation_and_retry_are_scoped_and_idempotent ... ok519test jobs::report::tests::upgrading_legacy_reports_preserves_errors_and_fences_old_attempts ... ok520test jobs::tests::claims_are_atomic_and_expired_leases_recover ... ok521test jobs::outbox::tests::worker_delivers_available_events_and_stops_cleanly ... ok522test jobs::report::stream_tests::download_keeps_its_snapshot_when_later_progress_archives_the_inline_tail ... ok523test jobs::tests::csv_job_persists_its_policy_with_the_upload ... ok524test jobs::tests::expired_final_attempt_fails_without_claiming_again ... ok525test jobs::tests::api_job_keeps_its_policy_across_duplicate_enqueue_and_manual_retry ... ok526test jobs::tests::failed_csv_commit_retains_confirmed_report_through_history_and_retry ... ok527test jobs::tests::failed_csv_preview_retains_confirmed_report_through_history_and_retry ... ok528test jobs::tests::concurrent_csv_resubmission_preserves_identity_after_upload_cleanup ... ok529test jobs::tests::cancellation_waits_for_the_claimed_execution_before_allowing_retry ... ok530test jobs::tests::history_paginates_tied_timestamps_and_rejects_foreign_cursors ... ok531test jobs::tests::cleanup_retains_retryable_uploads_and_deletes_expired_jobs ... ok532test jobs::tests::cancellation_survives_a_crash_before_the_worker_acknowledges ... ok533test importers::harvest::sync_tests::scale::durable_api_report_preserves_overflow_errors_after_recovery ... ok534test jobs::report::tests::report_fragments_survive_until_the_owning_job_expires ... ok535test jobs::tests::expired_lease_cannot_renew_or_commit_using_an_old_transaction_timestamp ... ok536test jobs::tests::invalid_policy_cannot_enqueue_a_job_or_upload ... ok537test jobs::tests::outbox_delivery_is_idempotent ... ok538test jobs::tests::final_failure_is_retained_and_manual_retry_gets_a_new_budget ... ok539test jobs::tests::outbox_stale_claims_cannot_acknowledge_or_reschedule_delivery ... ok540test jobs::tests::payload_kind_is_stable_and_round_trips ... ok541test jobs::tests::payload_versions_preserve_legacy_jobs_and_reject_unknown_versions ... ok542test jobs::tests::import_adapters_reject_a_lease_from_another_organization ... ok543test jobs::tests::retry_snapshot_does_not_guess_unknown_payloads_or_sources ... ok544test jobs::tests::retry_snapshot_matches_status_and_list_without_exposing_payload ... ok545test jobs::tests::shutdown_deadline_drops_and_joins_in_flight_work ... ok546test jobs::tests::shutdown_waits_for_in_flight_work ... ok547test jobs::tests::outbox_rollback_does_not_publish_an_event ... ok548test jobs::tests::reclaimed_attempt_rejects_stale_results_even_with_the_same_worker_name ... ok549test jobs::tests::invalid_stored_payloads_reach_a_terminal_error ... ok550test jobs::tests::synthetic_job_executes_through_claim_and_completion ... ok551test jobs::tests::synthetic_job_uses_the_same_registered_envelope ... ok552test jobs::tests::stopped_worker_leaves_queued_jobs_unclaimed ... ok553test models::project_creation::tests::draft_roundtrip_preserves_incomplete_input_without_demo_data ... ok554test models::project_creation::tests::unauthorized_catalog_cost_is_absent_from_serialized_options ... ok555test models::project_creation::tests::unknown_draft_fields_are_rejected ... ok556test jobs::tests::upload_organization_must_match_its_job ... ok557test notifications::tests::cancelling_delivery_kills_the_active_sender ... ok558test jobs::tests::submission_key_cannot_change_csv_bytes_or_mode ... ok559test notifications::tests::acknowledged_email_is_never_claimed_again ... ok560test notifications::tests::disabled_mail_worker_does_not_claim_pending_notifications ... ok561test notifications::tests::mail_configuration_is_disabled_by_default_and_rejects_partial_values ... ok562test notifications::tests::mail_configuration_requires_an_executable_file_and_safe_sender ... ok563test jobs::tests::outbox_same_kind_consumers_cannot_claim_the_same_lease ... ok564test notifications::tests::recipient_injection_is_rejected_before_starting_a_process ... ok565test notifications::tests::rendered_mail_bounds_body_lines_for_long_unicode_and_control_names ... ok566test notifications::tests::mail_worker_delivers_only_its_kind_and_drains_cleanly ... ok567test notifications::tests::failed_email_retries_same_identity_and_eventually_stops ... ok568test notifications::tests::foreign_notification_payload_is_terminal_and_never_sent ... ok569test notifications::tests::sendmail_failure_does_not_expose_program_output ... ok570test notifications::tests::sendmail_receives_fixed_arguments_and_stable_message_identity ... ok571test jobs::tests::missing_configuration_records_error_and_requeues ... ok572test notifications::tests::retry_can_recover_without_changing_message_identity ... ok573test pages::clients::filters::tests::clearing_query_preserves_selected_currency_and_lifecycle ... ok574test pages::clients::filters::tests::lifecycle_counts_share_query_and_currency_filters ... ok575test pages::clients::filters::tests::name_search_ignores_case_and_surrounding_whitespace ... ok576test pages::clients::filters::tests::preferred_or_visible_project_currency_matches_but_query_still_applies ... ok577test pages::clients::form::tests::absent_billing_authority_never_produces_an_edit_payload ... ok578test pages::clients::form::tests::ambiguous_creation_errors_require_explicit_recovery ... ok579test pages::clients::form::tests::clearing_a_rate_is_explicit_and_needs_no_currency_confirmation ... ok580test pages::clients::form::tests::invalid_fields_are_not_rewritten_by_validation ... ok581test pages::clients::form::tests::rate_replacement_requires_confirmation_in_the_current_currency ... ok582test pages::clients::form::tests::untouched_fields_keep_zero_rate_and_original_snapshot ... ok583test pages::importers::presentation::tests::interrupted_report_is_partial_regardless_of_retry_prerequisites ... ok584test pages::importers::presentation::tests::no_selection_does_not_claim_no_import_history ... ok585test pages::importers::presentation::tests::source_labels_do_not_guess_unknown_importers ... ok586test pages::importers::presentation::tests::states_and_phases_have_readable_unknown_fallbacks ... ok587test pages::importers::presentation::tests::summaries_distinguish_zero_skipped_and_mixed_outcomes ... ok588test pages::invoices::defaults_form::tests::invoice_fields_bound_metadata_by_characters_and_reject_nul ... ok589test pages::invoices::defaults_form::tests::invoice_fields_preserve_exact_percentages_and_custom_terms ... ok590test pages::invoices::defaults_form::tests::invoice_fields_preserve_receipt_terms_and_empty_optional_percentages ... ok591test pages::invoices::defaults_form::tests::invoice_fields_reject_invalid_percentages_terms_and_second_tax ... ok592test pages::invoices::preparation::fees::tests::fee_inputs_require_exact_amounts_and_an_explicit_positive_charge ... ok593test pages::invoices::preparation::fees::tests::refresh_keeps_raw_edits_and_does_not_select_new_sources ... ok594test pages::invoices::preparation::fees::tests::refresh_preserves_missing_or_relabelled_edits_until_explicit_removal ... ok595test pages::invoices::preparation::tests::invoice_context_selects_only_the_exact_available_client ... ok596test pages::invoices::preparation::tests::invoice_review_requires_matching_sources_and_valid_values ... ok597test pages::invoices::preparation::tests::unavailable_or_malformed_invoice_context_never_uses_the_first_client ... ok598test pages::new_project::basics::tests::a_batch_that_would_exceed_the_tag_limit_is_rejected ... ok599test pages::new_project::basics::tests::a_full_tag_list_still_accepts_a_duplicate ... ok600test pages::new_project::basics::tests::overlong_tags_are_rejected_without_truncation ... ok601test pages::new_project::basics::tests::tag_length_counts_characters_instead_of_bytes ... ok602test pages::new_project::basics::tests::tags_trim_and_deduplicate_without_changing_existing_spelling ... ok603test notifications::tests::revoked_recipient_does_not_receive_a_pending_email ... ok604test pages::new_project::draft::tests::a_mismatched_acknowledgement_does_not_lose_pending_input ... ok605test pages::new_project::draft::tests::a_retry_keeps_the_unacknowledged_payload_and_revision ... ok606test pages::new_project::draft::tests::a_validation_rejection_allows_corrected_input_at_the_same_revision ... ok607test pages::new_project::draft::tests::an_empty_form_is_not_reported_as_saved ... ok608test pages::new_project::billing::tests::budget_errors_target_a_control_that_can_be_corrected ... ok609test pages::new_project::draft::tests::any_saved_draft_wins_over_context_including_empty_or_matching_client ... ok610test pages::new_project::draft::tests::context_prefills_only_a_new_form_without_fixing_its_currency ... ok611test pages::new_project::draft::tests::resuming_preserves_the_server_identity_and_incomplete_fields ... ok612test pages::new_project::team::tests::adding_everyone_deduplicates_without_replacing_project_overrides ... ok613test pages::new_project::team::tests::exceeding_the_team_limit_does_not_partially_add_people ... ok614test pages::new_project::team::tests::removing_a_member_keeps_an_empty_restricted_task_restricted ... ok615test pages::new_project::tests::a_rejected_creation_can_be_edited_but_an_uncertain_commit_must_be_retried ... ok616test pages::new_project::tests::only_known_validation_fields_can_target_a_control ... ok617test pages::projects::budget_display_tests::display_preserves_units_sign_and_large_integer_values ... ok618test pages::projects::budget_display_tests::tag_filter_matches_identity_without_duplicates_or_name_collisions ... ok619test pages::projects::budget_display_tests::unallocated_zero_and_overflow_budgets_are_not_conflated ... ok620test pages::reports::tests::cost_total_uses_organization_currency_across_billing_currencies ... ok621test pages::reports::tests::mixed_currencies_are_not_added_even_when_the_numbers_would_overflow ... ok622test pages::reports::tests::monetary_total_overflow_is_visible_instead_of_panicking ... ok623test pages::reports::tests::redacted_costs_do_not_become_zero_or_partial_totals ... ok624test pages::reports::tests::single_currency_totals_are_formatted_and_empty_reports_have_no_amount ... ok625test pages::timesheet::tests::cal_span_day_shows_only_the_anchor_column ... ok626test pages::timesheet::tests::cal_span_defaults_to_week ... ok627test pages::timesheet::tests::cal_span_unknown_falls_back_to_week ... ok628test pages::projects::budget_display_tests::configured_scopes_sum_without_hiding_an_individual_overrun ... ok629test pages::timesheet::tests::cal_span_url_roundtrips ... ok630test pages::timesheet::tests::cal_span_week_shows_all_seven_days ... ok631test pages::timesheet::tests::cal_span_work_week_preserves_date_order_across_weekends ... ok632test pages::timesheet::tests::cal_span_work_week_shows_monday_to_friday ... ok633test pages::timesheet::tests::cal_span_work_week_skips_sunday_when_it_is_the_first_column ... ok634test pages::timesheet::tests::day_col_class_marks_today ... ok635test pages::timesheet::tests::day_col_class_marks_weekend ... ok636test pages::timesheet::tests::day_col_class_plain_weekday ... ok637test pages::timesheet::tests::day_col_class_today_wins_over_weekend ... ok638test pages::timesheet::tests::invalid_duration_cannot_start_a_timer_save_or_clear_a_cell ... ok639test pages::timesheet::tests::only_a_blank_duration_can_start_an_eligible_timer ... ok640test pages::timesheet::tests::timed_lanes_still_widens_overlapping_entries ... ok641test pages::timesheet::tests::timed_lanes_terminates_on_a_zero_length_entry ... ok642test pages::timesheet::tests::today_offset_is_none_after_the_week ... ok643test pages::timesheet::tests::today_offset_is_none_before_the_week ... ok644test pages::timesheet::tests::today_offset_is_six_on_the_sunday ... ok645test pages::timesheet::tests::today_offset_is_zero_on_the_monday ... ok646test pages::timesheet::tests::value_cell_class_empty_wins_over_today ... ok647test pages::timesheet::tests::value_cell_class_marks_today_when_nonzero ... ok648test pages::timesheet::tests::weekend_style_follows_the_date_not_the_column_offset ... ok649test pages::timesheet::tests::weekly_duration_edit_preserves_nine_am_start_notes_and_billability ... ok650test pages::timesheet::tests::weekly_new_entries_are_untimed_and_explicit_clears_still_work ... ok651test notifications::tests::verbose_sender_output_is_discarded_without_blocking_delivery ... ok652test notifications::tests::stale_email_lease_cannot_start_delivery ... ok653test plugin::database::tests::application_database_owner_is_not_a_plugin_identity ... ok654test plugin::database::tests::dedicated_reader_is_accepted_but_new_write_grants_are_rejected ... ok655test plugin::database::tests::reader_accepts_optional_first_party_rounding_helper ... ok656test plugin::database::tests::project_configuration_is_private_even_when_plugin_grants_are_misconfigured ... ok657test notifications::tests::sendmail_timeout_kills_and_reaps_the_child ... ok658test plugin::event::tests::active_transition_fires_only_on_a_real_flip ... ok659test plugin::event::tests::budget_and_timer_events_serialize ... ok660test plugin::event::tests::new_events_have_stable_hook_names ... ok661test plugin::event::tests::project_membership_payload_excludes_private_configuration ... ok662test plugin::event::tests::role_change_event_carries_previous_role ... ok663test plugin::event::tests::submission_event_serializes_payload ... ok664test plugin::event::tests::us2_events_have_stable_hook_names ... ok665test plugin::database::tests::reader_cannot_execute_security_definer_functions ... ok666test plugin::host::tests::config_lookup::a_set_key_is_returned ... ok667test plugin::host::tests::config_lookup::an_unset_key_is_none ... ok668test plugin::database::tests::reader_cannot_have_access_to_credentials ... ok669test plugin::database::tests::reader_cannot_switch_into_another_role ... ok670test plugin::database::tests::reader_rejects_unapproved_invoker_functions ... ok671test jobs::tests::outbox_claims_only_the_requested_event_kind ... ok672test plugin::host::tests::database_tests::unconfigured_sql_never_falls_back_to_application_state ... ok673test plugin::host::tests::database_queries_preserve_parameters_and_rollback_session_settings ... ok674test plugin::host::tests::response_shaping::error_json_wraps_the_message ... ok675test plugin::host::tests::response_shaping::http_body_accepts_the_size_limit_and_rejects_larger_responses ... ok676test plugin::host::tests::response_shaping::http_response_carries_status_and_body ... ok677test plugin::host::tests::response_shaping::invalid_http_utf8_is_an_error_not_an_empty_success ... ok678test plugin::host::tests::statement_is_read_only::a_cte_select_is_allowed ... ok679test plugin::host::tests::statement_is_read_only::a_second_statement_is_rejected ... ok680test plugin::host::tests::statement_is_read_only::a_single_trailing_semicolon_is_allowed ... ok681test plugin::host::tests::statement_is_read_only::a_write_hidden_behind_a_comment_is_rejected ... ok682test plugin::host::tests::statement_is_read_only::plain_select_is_allowed ... ok683test plugin::host::tests::statement_is_read_only::writes_are_rejected ... ok684test plugin::host::tests::wrap_select::strips_a_trailing_semicolon_before_wrapping ... ok685test plugin::host::tests::wrap_select::wraps_as_a_bounded_row_query ... ok686test plugin::manifest::tests::accepts_all_published_business_events ... ok687test plugin::manifest::tests::config_defaults_to_empty_when_absent ... ok688test plugin::manifest::tests::parse_valid_manifest ... ok689test plugin::manifest::tests::parses_optional_config_table ... ok690test plugin::manifest::tests::reject_empty_hooks ... ok691test plugin::manifest::tests::reject_unknown_hook ... ok692test plugin::host::tests::database_tests::query_discards_session_advisory_locks ... ok693test jobs::tests::submission_key_cannot_change_api_mode_or_scope ... ok694test plugin::host::tests::database_tests::query_results_are_bounded_without_silent_truncation ... ok695test plugin::host::tests::database_tests::select_cannot_write_or_gain_application_privileges ... ok696test jobs::tests::missing_csv_upload_records_error_and_requeues ... ok697698running 1 test699test plugin::registry::tests::initialization::guest_initializers_have_an_engine_instruction_budget ... ok700701test result: ok. 1 passed; 0 failed; 0 ignored; 0 measured; 846 filtered out; finished in 0.31s702703704running 1 test705test plugin::registry::tests::initialization::guest_initializers_have_an_engine_instruction_budget ... ok706707test result: ok. 1 passed; 0 failed; 0 ignored; 0 measured; 846 filtered out; finished in 0.22s708709710running 1 test711test plugin::registry::tests::initialization::guest_initializers_have_an_engine_instruction_budget ... ok712713test result: ok. 1 passed; 0 failed; 0 ignored; 0 measured; 846 filtered out; finished in 0.30s714715716running 1 test717test plugin::registry::tests::initialization::guest_initializers_have_an_engine_instruction_budget ... ok718719test result: ok. 1 passed; 0 failed; 0 ignored; 0 measured; 846 filtered out; finished in 0.30s720721test plugin::registry::tests::initialization::guest_initializers_have_an_engine_instruction_budget ... ok722test plugin::registry::tests::initialization::instruction_budget_is_replenished_for_each_call ... ok723test plugin::host::tests::database_tests::wasm_host_uses_the_restricted_connection_on_a_current_thread_runtime ... ok724test plugin::registry::tests::isolation::cancelling_a_waiter_keeps_capacity_reserved_until_the_host_call_exits ... ok725test plugin::host::tests::a_query_cannot_disable_its_own_deadline ... ok726test plugin::registry::tests::isolation::confirmed_dispatch_returns_overload_for_retry ... ok727test plugin::registry::tests::isolation::a_wasm_timeout_releases_the_worker_and_instance ... ok728test plugin::registry::tests::isolation::confirmed_dispatch_waits_for_the_plugin_to_finish ... ok729test plugin::registry::tests::isolation::different_plugins_share_the_running_call_limit ... ok730test plugin::registry::tests::isolation::events_execute_outside_the_async_worker ... ok731test plugin::registry::tests::isolation::confirmed_dispatch_returns_plugin_failure_for_retry ... ok732test plugin::registry::tests::isolation::loaded_plugins_cannot_grow_memory_past_the_limit ... ok733test plugin::registry::tests::isolation::confirmed_dispatch_attempts_other_plugins_after_one_fails ... ok734test plugin::registry::tests::isolation::loaded_plugins_cannot_start_with_excessive_memory ... ok735test plugin::registry::tests::isolation::pending_capacity_rejects_new_work_without_spawning_tasks ... ok736test plugin::registry::tests::isolation::oversized_wasm_output_is_rejected_before_copying_it ... ok737test plugin::registry::tests::load_empty_directory ... ok738test plugin::registry::tests::isolation::widgets_execute_outside_the_async_worker ... ok739test plugin::registry::tests::load_nonexistent_directory ... ok740test plugin::registry::tests::isolation::oversized_event_payloads_are_not_queued ... ok741test reports::bounded::tests::cancelled_export_keeps_its_slot_until_the_renderer_exits ... ok742test reports::bounded::tests::export_admission_stays_reserved_until_the_body_is_dropped ... ok743test reports::bounded::tests::export_rendering_runs_off_the_async_worker ... ok744test reports::bounded::tests::output_budget_checks_writes_and_seeks_without_truncation ... ok745test render::tests::invoice_template_formats_large_minor_units_exactly ... ok746test reports::bounded::tests::rendered_output_limit_rejects_oversized_files_and_releases_admission ... ok747test reports::bounded::tests::renderer_errors_and_panics_release_admission ... ok748test plugin::registry::tests::dispatch_event_with_no_subscribers ... ok749test reports::bounded::tests::timed_out_export_keeps_its_slot_until_the_renderer_exits ... ok750test plugin::registry::tests::load_test_plugins ... ok751test plugin::registry::tests::collect_widgets_from_echo_plugin ... ok752test reports::limits::tests::bounded_entries_enforce_the_row_limit_after_all_filters ... ok753test plugin::registry::tests::dispatch_invoice_sent_to_echo_plugin ... ok754test plugin::registry::tests::failing_plugin_does_not_block_caller ... ok755test plugin::registry::tests::dispatch_to_echo_plugin_succeeds ... ok756test reports::limits::tests::export_queries_are_read_only_and_have_a_database_deadline ... ok757test reports::limits::tests::measure_bounded_export_limits ... ignored, manual release export measurement; set HORAE_EXPORT_PROBE_DIR for artifacts758test reports::limits::tests::export_size_checks_and_reads_share_a_repeatable_read_snapshot ... ok759test reports::limits::tests::bounded_exports_preserve_real_workbooks_and_deterministic_pdf ... ok760test reports::limits::tests::bounded_invoice_limits_include_branding_and_preserve_tenant_scope ... ok761test reports::limits::tests::bounded_projects_filter_archives_before_size_checks ... ok762test reports::limits::tests::bounded_entries_reject_large_fields_and_combined_text ... ok763test reports::streaming::database_tests::measure_streaming_csv_export ... ignored, Manual release measurement of a 100,000-row CSV download764test reports::privacy_tests::project_downloads_follow_progress_visibility ... ok765test reports::streaming::database_tests::streamed_fee_invoice_has_no_fabricated_hours_or_hourly_rate ... ok766test reports::limits::tests::fee_exports_preserve_absent_quantities_and_render_a_real_pdf ... ok767test reports::limits::tests::invoice_exports_show_saved_adjustments_and_exact_large_amounts ... ok768test reports::streaming::database_tests::streamed_tag_filter_excludes_other_projects_without_duplicating_rows ... ok769test reports::streaming::database_tests::streamed_timesheet_exceeds_xlsx_row_limit_without_one_large_body_chunk ... ok770test reports::limits::tests::tag_filter_applies_before_xlsx_size_checks_and_rendering ... ok771test reports::streaming::tests::completed_csv_keeps_admission_until_body_drop ... ok772test reports::streaming::tests::csv_backpressure_and_body_drop_bound_and_cancel_source_reads ... ok773test reports::streaming::tests::csv_does_not_truncate_a_quoted_unicode_record_larger_than_a_chunk ... ok774test reports::streaming::tests::csv_emits_a_chunk_before_the_source_finishes ... ok775test reports::streaming::tests::csv_failure_or_panic_after_a_chunk_is_not_successful_eof ... ok776test reports::streaming::tests::csv_startup_errors_are_http_errors_and_release_admission ... ok777test reports::streaming::database_tests::streamed_invoice_metadata_and_lines_share_one_snapshot ... ok778test reports::streaming::tests::dropping_csv_during_startup_cancels_the_producer ... ok779test route::tests::client_detail_preserves_identity_and_highlights_only_clients ... ok780test route::tests::client_workflow_paths_preserve_context_and_navigation_section ... ok781test route::tests::edit_project_preserves_identity_and_highlights_only_projects ... ok782test route::tests::malformed_context_reaches_the_workflow_for_validation_after_recovery ... ok783test route::tests::new_project_is_static_and_highlights_only_projects ... ok784test reports::streaming::tests::csv_timeout_interrupts_an_already_started_body ... ok785test reports::streaming::database_tests::streamed_projects_preserve_scope_budget_and_tenant_isolation ... ok786test reports::privacy_tests::unauthorized_project_text_does_not_affect_export_size_limits ... ok787test seed::tests::late_seed_failure_rolls_back_all_demo_data ... ok788test seed::tests::concurrent_initializers_cannot_create_two_organizations ... ok789test seed::tests::concurrent_seed_runs_create_only_one_demo ... ok790test reports::streaming::database_tests::dropping_streamed_timesheet_closes_its_database_connection ... ok791test seed::tests::seed_refuses_an_initialized_organization_without_writes ... ok792test server_fns::approvals::submission_tests::cancelling_a_submission_releases_its_write_barrier ... ok793test seed::tests::seed_refuses_a_second_organization_even_when_the_demo_exists ... ok794test server_fns::approvals::submission_tests::submission_barrier_allows_shared_writers_for_the_same_user ... ok795test reports::streaming::database_tests::streamed_invoice_uses_stored_exact_cents_and_tenant_scoped_metadata ... ok796test server_fns::approvals::submission_tests::submission_accepts_the_organizations_sunday_start ... ok797test server_fns::approvals::submission_tests::submission_does_not_wait_for_another_users_writer ... ok798test server_fns::approvals::submission_tests::submission_freezes_the_minutes_after_a_competing_edit ... ok799test reports::streaming::database_tests::a_real_database_error_interrupts_the_csv_body ... ok800test server_fns::approvals::submission_tests::submission_rejects_a_start_that_is_not_the_organizations_week_start ... ok801test server_fns::approvals::submission_tests::submission_waits_for_a_new_timer_before_checking_the_week ... ok802test server_fns::approvals::tests::ignores_stopped_and_out_of_week_timers ... ok803test server_fns::approvals::submission_tests::submission_uses_one_pool_connection ... ok804test reports::streaming::database_tests::streamed_timesheet_preserves_csv_escaping_frozen_zero_and_all_filters ... ok805test server_fns::approvals::tests::sees_a_running_timer_inside_the_week ... ok806test server_fns::budget_tests::budget_notification_schema_enforces_tenants_and_no_public_access ... ok807test server_fns::budget_tests::concurrent_budget_checks_have_one_band_claimant ... ok808test server_fns::budget_tests::configured_alert_and_outbox_roll_back_together ... ok809test server_fns::budget_tests::configured_alert_recipients_are_active_same_org_managers_and_project_leads ... ok810test seed::tests::repeated_seed_preserves_every_row_and_user_edits ... ok811test server_fns::budget_tests::configured_alerts_deduplicate_concurrent_checks_and_recrossing ... ok812test server_fns::budget_tests::configured_budget_does_not_read_foreign_or_legacy_projects ... ok813test server_fns::budget_tests::configured_alerts_require_enabled_active_project_and_authorized_recipient ... ok814test server_fns::budget_tests::configured_amount_budget_uses_resolved_rates_and_explicit_zero ... ok815test server_fns::budget_tests::configured_monthly_budget_includes_leap_day_and_preserves_locked_rounding ... ok816test server_fns::budget_tests::configured_budget_sweep_recovers_missed_checks_without_duplicates ... ok817test seed::tests::seed_leaves_an_older_or_partial_demo_unchanged ... ok818test server_fns::budget_tests::configured_monthly_budget_excludes_other_months_and_nonbillable_time ... ok819test server_fns::budget_tests::configured_nonbillable_projects_count_time_without_hidden_checkbox ... ok820test server_fns::budget_tests::configured_person_budget_excludes_other_people_and_has_its_own_alert ... ok821test server_fns::budget_tests::configured_task_and_person_budgets_do_not_share_consumption ... ok822test server_fns::budget_tests::overview_budget_progress_includes_people_without_an_allowance ... ok823test server_fns::budget_tests::configured_task_fee_budget_respects_billability_and_alert_scope ... ok824test seed::tests::concurrent_init_and_seed_cannot_mix_organizations ... ok825test server_fns::budget_tests::overview_budget_progress_batches_projects_without_mixing_scopes ... ok826test server_fns::budget_tests::overview_budget_progress_is_current_period_scoped_and_authorized ... ok827test server_fns::clients::tests::client_default_rate_allows_detail_edits_and_equivalent_currency ... ok828test server_fns::clients::tests::client_default_rate_prevents_currency_relabelling ... ok829test server_fns::clients::tests::both_activation_transitions_change_once_and_preserve_details ... ok830test server_fns::clients::tests::client_details_hide_foreign_missing_and_inactive_actor_records ... ok831test server_fns::clients::tests::client_details_keep_catalog_identity_but_omit_member_billing ... ok832test server_fns::clients::tests::client_details_distinguish_unset_zero_and_positive_manager_rates ... ok833test server_fns::clients::tests::client_invoices_hold_authority_until_the_read_finishes ... ok834test server_fns::clients::tests::client_invoices_require_manager_authority_even_without_invoices ... ok835test server_fns::clients::tests::client_invoices_keep_exact_client_scope_statuses_and_currencies ... ok836test server_fns::clients::tests::client_invoices_reject_a_winning_concurrent_revocation ... ok837test server_fns::clients::tests::client_summaries_exclude_foreign_clients_and_unreadable_project_currencies ... ok838test server_fns::clients::tests::client_summaries_follow_existing_progress_visibility_and_revoke_inactive_users ... ok839test server_fns::clients::tests::client_summaries_keep_catalog_without_projects_and_count_archived_projects ... ok840test server_fns::clients::tests::client_summaries_reject_a_foreign_actor_even_when_client_org_is_known ... ok841test server_fns::clients::tests::concurrent_deletion_is_not_an_unchanged_mutation ... ok842test server_fns::clients::tests::currency_edit_rechecks_a_concurrently_added_client_default_rate ... ok843test server_fns::clients::tests::each_field_changes_once_and_preserves_inactive_status ... ok844test server_fns::clients::tests::missing_and_foreign_clients_are_not_noops ... ok845test server_fns::clients::tests::profile_create_persists_normalized_identity_and_exact_optional_rate ... ok846test server_fns::clients::tests::profile_currency_change_without_a_rate_keeps_it_unset ... ok847test server_fns::clients::tests::profile_noop_preserves_row_and_returns_no_update_event_signal ... ok848test server_fns::clients::tests::profile_saves_recheck_manager_org_and_active_actor ... ok849test server_fns::clients::tests::profile_saves_reject_invalid_input_without_partial_writes ... ok850test server_fns::clients::tests::profile_update_preserves_historical_rows_and_inactive_status ... ok851test server_fns::clients::tests::profile_update_rechecks_authority_after_waiting_for_a_concurrent_demotion ... ok852test server_fns::clients::tests::profile_update_rejects_stale_currency_even_when_the_rate_is_still_unset ... ok853test server_fns::clients::tests::profile_update_rechecks_financial_snapshot_after_waiting_for_a_concurrent_edit ... ok854test server_fns::clients::tests::profile_update_rejects_stale_rate_even_when_the_target_currency_is_unchanged ... ok855test server_fns::importers::authorization_tests::cli_job_endpoints_have_stable_registered_paths ... ok856test server_fns::clients::tests::profile_update_requires_explicit_rate_intent_for_currency_changes ... ok857test server_fns::importers::authorization_tests::report_stress::large_report_streams_over_http_without_buffering_the_archive ... ignored, isolated Linux HTTP/memory stress; run with --release --exact --ignored --nocapture858test server_fns::importers::authorization_tests::request_bound_import_endpoints_are_not_registered ... ok859test server_fns::importers::csv_upload::tests::csv_upload_extractor_preserves_raw_bytes ... ok860test server_fns::importers::csv_upload::tests::csv_upload_requires_its_header_without_reading_the_body ... ok861test server_fns::importers::tests::concurrent_api_import_returns_a_retryable_conflict ... ok862test server_fns::importers::tests::csv_route_rejects_invalid_modes_and_headers_without_reading_uploads ... ok863test server_fns::importers::tests::submission_identity_rejects_expired_future_and_non_v7_keys ... ok864test server_fns::clients::tests::repeating_a_competing_deactivation_does_not_report_a_transition ... ok865test server_fns::clients::tests::restoring_a_competing_deactivation_reports_reactivation ... ok866test server_fns::clients::tests::repeating_a_competing_edit_does_not_report_a_change ... ok867test server_fns::clients::tests::restoring_values_after_a_competing_edit_reports_a_change ... ok868test server_fns::clients::tests::unchanged_edit_preserves_the_row ... ok869test server_fns::clients::tests::unchanged_activation_preserves_the_row ... ok870test server_fns::invoices::fee_tests::concurrent_invoices_claim_a_single_fee_once ... ok871test server_fns::importers::authorization_tests::job_endpoints_enforce_session_role_and_organization ... FAILED872test server_fns::invoices::fee_tests::fee_balance_migration_allocates_discount_without_rewriting_invoice_snapshots ... ok873test server_fns::invoices::fee_tests::fee_invoice_does_not_claim_hours_or_another_clients_fee ... ok874test server_fns::invoices::fee_tests::fee_occurrence_rejects_cross_organization_project ... ok875test server_fns::invoices::fee_tests::fee_preview_discount_ties_follow_source_keys_not_display_dates ... ok876test server_fns::invoices::fee_tests::fee_total_overflow_rolls_back_occurrences_and_invoice ... ok877test server_fns::invoices::fee_tests::discounted_fee_leaves_a_balance_and_void_releases_only_its_contribution ... ok878test server_fns::invoices::fee_tests::invoice_line_sources_reject_mixed_sources_and_invented_fee_quantities ... ok879test server_fns::invoices::fee_tests::fee_preview_keeps_source_identity_and_reports_discounted_draft_balances ... ok880test server_fns::invoices::fee_tests::draft_fee_edit_rejects_invalid_lines_and_current_unauthorized_actors ... ok881test server_fns::invoices::fee_tests::milestones_include_unbilled_overdue_fees_but_not_future_fees ... ok882test server_fns::invoices::fee_tests::invoice_preview_does_not_materialize_fees_and_preserves_released_snapshots ... ok883test server_fns::invoices::fee_tests::monthly_fees_use_calendar_dates_and_skip_already_claimed_months ... ok884test server_fns::invoices::fee_tests::draft_fee_edit_replaces_amount_and_preserves_source_and_retry_identity ... ok885test server_fns::invoices::fee_tests::monthly_first_and_fifteenth_respect_partial_period_and_project_end ... ok886test server_fns::invoices::fee_tests::invoice_status_rechecks_authority_after_waiting_for_the_invoice_lock ... ok887test server_fns::invoices::fee_tests::prepared_fee_selection_rejects_invalid_values_and_empty_generation ... ok888test server_fns::invoices::fee_tests::removing_discount_and_billing_the_remainder_cannot_both_succeed ... ok889test server_fns::invoices::fee_tests::project_fee_context_matches_invoice_balances_and_current_authority ... ok890test server_fns::invoices::fee_tests::mixed_time_and_fee_discount_conserves_cents_without_reopening_time ... ok891test server_fns::invoices::fee_tests::reviewed_generation_bills_partial_fees_and_rejects_stale_balances ... ok892test server_fns::invoices::fee_tests::reviewed_generation_does_not_materialize_unselected_months ... ok893test server_fns::invoices::fee_tests::settled_fee_sources_remain_reviewable_without_automatic_charges ... ok894test server_fns::invoices::fee_tests::single_fee_can_be_invoiced_without_time ... ok895test server_fns::invoices::fee_tests::reviewed_generation_requires_exact_excess_and_current_authority ... ok896test server_fns::invoices::fee_tests::void_releases_fee_identity_without_rewriting_the_original_line ... ok897test server_fns::invoices::preview::tests::excess_rejects_an_unrepresentable_total_even_when_the_remainder_fits ... ok898test server_fns::invoices::preview::tests::unselected_fee_currencies_do_not_relabel_or_block_selected_charges ... ok899test server_fns::invoices::fee_tests::draft_fee_edit_requires_current_balance_and_exact_excess_confirmation ... ok900test server_fns::invoices::fee_tests::zero_fee_is_invoiced_once_until_voided ... ok901test server_fns::invoices::tests::billing_cascade_agrees_across_all_four_levels_including_zero ... ok902test server_fns::invoices::tests::configured_fixed_fee_hours_are_not_invoiced_but_legacy_fees_are_unchanged ... ok903test server_fns::invoices::tests::effective_minutes_migration_preserves_historical_invoice_quantities ... ok904test server_fns::invoices::fee_tests::draft_fee_edit_serializes_retries_and_rejects_stale_revisions ... ok905test server_fns::invoices::tests::configured_project_currency_and_cost_override_keep_their_denominations ... ok906test server_fns::invoices::tests::imported_rates::imported_legacy_project_keeps_exact_rates_and_totals_on_retry ... ok907test server_fns::invoices::fee_tests::project_fee_context_keeps_monthly_balances_separate ... ok908test server_fns::invoices::fee_tests::concurrent_discounted_invoice_retries_return_one_invoice ... ok909test server_fns::invoices::tests::invoice_defaults_are_invoice_owned_and_only_drafts_are_editable ... ok910test server_fns::invoices::tests::effective_minutes_sql_matches_domain_rounding ... ok911test server_fns::invoices::tests::imported_rates::rejected_import_rate_does_not_poison_the_next_row_or_its_catalog_rate ... ok912test server_fns::invoices::fee_tests::reviewed_generation_rejects_changed_time_before_claiming_it ... ok913test server_fns::invoices::tests::invoice_defaults_selection_rejects_unavailable_projects_before_claiming ... ok914test server_fns::invoices::tests::invoice_defaults_validate_all_override_fields ... ok915test server_fns::invoices::tests::invoice_line_overflow_leaves_time_unbilled ... ok916test server_fns::invoices::tests::invoice_defaults_legacy_insert_preserves_dates_and_exact_total ... ok917test server_fns::invoices::tests::invoice_defaults_apply_exact_adjustments_and_payment_terms ... ok918test server_fns::invoices::fee_tests::invoice_defaults_apply_to_selected_fees_without_claiming_other_projects ... ok919test server_fns::invoices::tests::invoice_preview_keeps_time_rates_and_defaults_in_one_snapshot ... ok920test server_fns::invoices::tests::invoice_total_overflow_leaves_all_time_unbilled ... ok921test server_fns::invoices::tests::imported_rates::imported_task_rates_require_matching_currency_only_for_new_configured_links ... ok922test server_fns::invoices::tests::invoice_transitions_reject_invalid_states_and_foreign_organizations ... ok923test server_fns::invoices::tests::invoiced_amounts_survive_rate_changes_and_void_uses_current_rates ... ok924test server_fns::invoices::tests::invoice_preview_requires_explicit_resolution_and_scopes_selected_projects ... ok925test server_fns::invoices::tests::invoiced_billability_survives_later_project_changes ... ok926test server_fns::invoices::tests::invoicing_leaves_running_time_open ... ok927test server_fns::invoices::tests::invoicing_uses_and_freezes_effective_minutes ... ok928test server_fns::invoices::tests::invoice_defaults_edit_rechecks_status_after_waiting_for_a_concurrent_send ... ok929test server_fns::invoices::tests::mixed_project_currencies_cannot_partially_create_an_invoice ... ok930test server_fns::invoices::tests::large_invoice_and_reports_agree_without_intermediate_overflow ... ok931test server_fns::invoices::tests::only_running_time_does_not_create_an_invoice ... ok932test server_fns::invoices::tests::non_billable_context_produces_no_unbilled_amount_on_any_report ... ok933test server_fns::invoices::tests::project_rate_is_used_by_invoices_reports_and_spend ... ok934test server_fns::invoices::tests::invoice_preview_matches_generation_without_claiming_time ... ok935test server_fns::invoices::tests::void_reopens_time_without_stale_rounding ... ok936test server_fns::invoices::tests::void_waits_for_a_concurrent_payment_and_then_refuses ... ok937test server_fns::invoices::tests::selected_project_rate_modes_agree_across_billing_consumers ... ok938test server_fns::organization::tests::each_branding_field_changes_once_including_null_and_empty ... ok939test server_fns::organization::tests::missing_organization_is_not_an_unchanged_update ... ok940test server_fns::organization::tests::repeating_a_competing_branding_edit_does_not_report_a_change ... ok941test server_fns::organization::tests::restoring_branding_after_a_competing_edit_reports_a_change ... ok942test server_fns::organization::tests::unchanged_branding_preserves_the_row ... ok943test server_fns::project_creation::assignment_tests::finalization_reuses_catalog_and_keeps_lead_overrides_local_on_retry ... ok944test server_fns::project_creation::editing::tests::concurrent_edits_have_one_winner_and_association_writes_invalidate_open_forms ... ok945test server_fns::invoices::tests::invoice_defaults_conflict_rolls_back_all_claims ... ok946test server_fns::project_creation::assignment_tests::invalid_assignment_graphs_leave_no_partial_creation_or_draft_change ... ok947test server_fns::project_creation::editing::tests::editor_keeps_archived_selected_identities_and_nullable_overrides ... ok948test server_fns::project_creation::editing::tests::editing_milestones_keeps_invoice_snapshots_and_fee_identities_immutable ... ok949test server_fns::project_creation::editing::tests::editor_rechecks_tenant_role_and_active_status ... ok950test server_fns::project_creation::editing::tests::editor_preserves_fee_schedule_and_operational_milestone_ids ... ok951test server_fns::project_creation::editing::tests::editor_loads_legacy_values_without_fabricating_a_billing_mode_or_draft ... ok952test server_fns::project_creation::editing::tests::editor_recovers_full_configuration_and_redacts_private_values_after_role_change ... ok953test server_fns::project_creation::editing::tests::editor_recovers_each_budget_scope_without_turning_absence_into_zero ... ok954test server_fns::project_creation::editing::tests::foreign_actor_cannot_save_or_retry_another_organizations_edit ... ok955test server_fns::project_creation::editing::tests::manager_edit_preserves_private_settings_and_cannot_remove_them_indirectly ... ok956test server_fns::project_creation::editing::tests::save_edits_the_same_legacy_project_and_never_creates_a_draft_or_configuration ... ok957test server_fns::project_creation::editing::tests::save_updates_configured_sections_atomically_and_rejects_stale_or_invalid_edits ... ok958test server_fns::project_creation::editing::tests::editor_load_uses_current_role_across_all_billing_configurations ... ok959test server_fns::project_creation::editing::tests::save_preserves_recorded_time_and_rejects_removing_its_task_or_person ... ok960test server_fns::project_creation::editing::tests::task_catalog_and_graph_changes_roll_back_together_on_duplicate_resolution ... ok961test server_fns::project_creation::editing::tests::saves_recheck_current_authority_and_do_not_repeat_noops ... ok962test server_fns::project_creation::tests::billing_schema_rejects_partial_fee_schedules ... ok963test server_fns::project_creation::tests::client_dialog_validates_details_and_persists_an_explicit_zero_rate ... ok964test server_fns::project_creation::tests::creation_actor_is_revalidated_inside_the_transaction ... ok965test server_fns::project_creation::tests::creation_client_must_be_active_and_in_the_same_organization ... ok966test server_fns::project_creation::tests::creation_options_are_scoped_bounded_and_redact_manager_costs ... ok967test server_fns::project_creation::tests::draft_ownership_discard_and_role_changes_are_enforced ... ok968test server_fns::project_creation::tests::draft_save_retries_do_not_overwrite_a_newer_revision ... ok969test server_fns::invoices::tests::invoice_preview_rejects_large_results_instead_of_truncating_them ... ok970test server_fns::project_creation::tests::draft_validation_preserves_incomplete_input_but_bounds_its_size ... ok971test server_fns::project_creation::tests::draft_schema_rejects_foreign_creator_and_completed_project ... ok972test server_fns::project_creation::tests::final_validation_checks_invoice_defaults_and_scoped_budget_totals ... ok973test server_fns::project_creation::tests::final_validation_preserves_exact_budgets_and_rejects_unavailable_email ... ok974test server_fns::project_creation::tests::final_validation_requires_complete_fee_schedules_and_distinct_entities ... ok975test server_fns::project_creation::tests::final_validation_requires_real_details_and_ignores_hidden_type_settings ... ok976test server_fns::project_creation::tests::draft_schema_enforces_one_current_draft_per_creator ... ok977test server_fns::project_creation::tests::draft_schema_rejects_oversize_payload_and_invalid_revision ... ok978test server_fns::project_creation::tests::existing_projects_have_no_implicit_new_billing_configuration ... ok979test server_fns::project_creation::tests::finalization_persists_task_access_and_project_only_financial_overrides ... ok980test server_fns::project_creation::tests::managers_cannot_store_administrator_notes_or_costs_in_a_draft ... ok981test server_fns::invoices::tests::assignment_gate_allows_inflight_invoice_organization_fks_to_finish ... ok982test server_fns::project_creation::tests::finalization_rechecks_client_role_revision_and_rate_currency ... ok983test server_fns::project_creation::tests::finalize_is_atomic_and_repeated_submission_returns_one_project ... ok984test server_fns::project_creation::tests::invalid_task_rolls_back_project_and_keeps_the_draft ... ok985test server_fns::project_creation::tests::missing_draft_responses_do_not_disclose_foreign_ownership ... ok986test server_fns::project_creation::validation::tests::assignment_rejections_identify_the_invalid_row ... ok987test server_fns::project_creation::validation::tests::basic_rejections_identify_the_field_without_echoing_input ... ok988test server_fns::project_creation::validation::tests::billing_rejections_identify_the_active_control ... ok989test server_fns::project_creation::validation::tests::inactive_billing_inputs_remain_in_the_draft_without_blocking_creation ... ok990test server_fns::project_creation::validation::tests::invoice_rejections_identify_the_field_without_echoing_input ... ok991test server_fns::project_creation::validation::tests::milestone_rejections_target_the_invalid_row_by_identity ... ok992test server_fns::project_creation::validation::tests::non_billable_projects_ignore_hidden_invoice_inputs ... ok993test server_fns::project_creation::validation::tests::task_name_and_access_rejections_identify_the_invalid_row ... ok994test server_fns::project_creation::import_tests::imported_catalog_rate_cannot_be_relabelled_as_workspace_currency ... ok995test server_fns::project_creation::tests::selected_catalog_bounds_requests_and_excludes_inactive_people ... ok996test server_fns::project_creation::tests::selected_catalog_is_scoped_deduplicated_and_redacts_manager_costs ... ok997test server_fns::project_creation::tests::selected_client_lookup_is_scoped_and_keeps_archived_identity ... ok998test server_fns::project_creation::tests::simultaneous_draft_updates_have_one_winner ... ok999test server_fns::project_creation::import_tests::imports_preserve_finalized_project_configuration_and_restricted_access ... ok1000test server_fns::projects::assignment_tests::assignment_mutations_wait_for_revocation_and_recheck_authority ... ok1001test server_fns::projects::bulk_tests::bulk_accepts_one_hundred_projects_and_mixed_status_noops ... ok1002test server_fns::projects::bulk_tests::bulk_ids_validate_before_writes_and_normalize_duplicates ... ok1003test server_fns::projects::bulk_tests::bulk_database_failure_rolls_back_earlier_changes ... ok1004test server_fns::projects::assignment_tests::creation_rejects_foreign_and_unknown_project_or_person ... ok1005test server_fns::projects::bulk_tests::bulk_missing_or_foreign_project_rolls_back_earlier_changes ... ok1006test server_fns::projects::bulk_tests::bulk_reversed_overlapping_batches_finish_without_deadlock ... ok1007test server_fns::projects::assignment_tests::stale_administrator_cannot_create_or_remove_after_revocation ... ok1008test server_fns::projects::bulk_tests::bulk_preserves_invoiced_history_assignments_and_spend ... ok1009test server_fns::projects::bulk_tests::bulk_status_preserves_details_history_and_noop_versions ... ok1010test server_fns::projects::details_tests::project_details_only_offer_task_rate_currency_to_current_managers ... ok1011test server_fns::projects::mutation_tests::project::both_activation_transitions_preserve_details_and_change_once ... ok1012test server_fns::projects::assignment_tests::project_membership_and_task_callers_wait_before_authorizing ... ok1013test server_fns::projects::mutation_tests::project::concurrent_deletion_is_rejected_by_both_mutations ... ok1014test server_fns::projects::mutation_tests::project::budgets_and_rates_distinguish_null_zero_and_normalized_values ... ok1015test server_fns::projects::details_tests::project_details_and_tags_follow_current_progress_and_private_permissions ... ok1016test server_fns::projects::mutation_tests::project::configured_edits_preserve_non_hourly_billing ... ok1017test server_fns::projects::mutation_tests::project::configured_edits_recheck_settings_after_waiting_for_the_project ... ok1018test server_fns::projects::mutation_tests::project::configured_edits_preserve_compatible_changes_and_idempotence ... ok1019test server_fns::projects::mutation_tests::project::configured_edits_reject_incompatible_financial_changes_atomically ... ok1020test server_fns::projects::mutation_tests::project::invalid_project_fields_leave_the_row_unchanged ... ok1021test server_fns::projects::mutation_tests::project::inactive_project_edits_preserve_identity_and_reject_implicit_migrations ... ok1022test server_fns::projects::mutation_tests::project::missing_and_foreign_rows_are_not_noops ... ok1023test server_fns::projects::mutation_tests::project::repeating_a_competing_deactivation_reports_no_transition ... ok1024test server_fns::projects::mutation_tests::project::restoring_a_competing_deactivation_reports_reactivation ... ok1025test server_fns::projects::mutation_tests::project::repeating_a_competing_edit_requires_a_fresh_revision ... ok1026test server_fns::project_creation::locking_tests::every_project_entry_gates_before_actor_and_rechecks_revocation ... ok1027test server_fns::projects::mutation_tests::project::restoring_a_competing_edit_does_not_overwrite_the_other_session ... ok1028test server_fns::projects::mutation_tests::project::unchanged_activation_preserves_the_row ... ok1029test server_fns::projects::mutation_tests::task::both_activation_transitions_preserve_details_and_change_once ... ok1030test server_fns::projects::mutation_tests::project::unchanged_edit_preserves_the_row ... ok1031test server_fns::projects::assignment_tests::own_assignment_lifecycle_preserves_role_and_duplicate_behavior ... ok1032test server_fns::projects::mutation_tests::task::concurrent_deletion_returns_not_found_for_both_mutations ... ok1033test server_fns::projects::mutation_tests::task::each_detail_field_changes_once_and_preserves_inactive_status ... ok1034test server_fns::projects::mutation_tests::task::missing_and_foreign_rows_are_not_noops ... ok1035test server_fns::projects::mutation_tests::task::rate_edits_set_currency_without_relabelling_renames_or_noops ... ok1036test server_fns::projects::mutation_tests::task::repeating_a_competing_deactivation_reports_no_transition ... ok1037test server_fns::projects::details_tests::unlinked_and_private_project_tags_do_not_leak_into_filters ... ok1038test server_fns::projects::mutation_tests::task::restoring_a_competing_deactivation_reports_reactivation ... ok1039test server_fns::projects::mutation_tests::task::repeating_a_competing_edit_does_not_report_a_change ... ok1040test server_fns::projects::mutation_tests::task::unchanged_activation_preserves_the_row ... ok1041test server_fns::projects::mutation_tests::task::restoring_a_competing_edit_reports_a_change ... ok1042test server_fns::projects::mutation_tests::task::unchanged_edit_preserves_the_row ... ok1043test server_fns::projects::assignment_tests::removal_preserves_foreign_and_malformed_assignments ... ok1044test server_fns::projects::privacy_tests::client_project_filter_preserves_progress_access_and_rate_redaction ... ok1045test server_fns::projects::privacy_tests::legacy_members_retain_progress_without_new_settings ... ok1046test server_fns::projects::privacy_tests::private_progress_does_not_prevent_tracking_or_reveal_financial_fields ... ok1047test server_fns::projects::privacy_tests::outsiders_and_inactive_viewers_have_no_project_reads ... ok1048test server_fns::projects::privacy_tests::project_members_and_leads_receive_progress_without_rates ... ok1049test server_fns::projects::privacy_tests::project_reads_use_current_authority_and_reject_foreign_scope ... ok1050test server_fns::projects::tests::assignments_are_scoped_to_the_viewers_organization ... ok1051test server_fns::projects::privacy_tests::revoked_membership_preserves_only_own_historical_tracking_identity ... ok1052test server_fns::projects::tests::creating_a_project_task_enables_it_with_its_defaults ... ok1053test server_fns::projects::tests::enabling_is_tenant_scoped_even_for_existing_links_and_preserves_overrides ... ok1054test server_fns::projects::tests::enabling_tasks_accepts_exact_project_currency_rates_and_preserves_existing_links ... ok1055test server_fns::projects::tests::project_rate_distinguishes_inheritance_zero_and_exact_amounts ... ok1056test server_fns::projects::tests::enabling_tasks_rejects_explicit_rates_unused_by_the_project ... ok1057test server_fns::projects::tests::enabling_tasks_rejects_incompatible_catalog_currency ... ok1058test server_fns::projects::tests::enabling_tasks_rejects_invalid_or_wrong_currency_explicit_rates_without_linking ... ok1059test server_fns::projects::tests::failed_project_task_creation_leaves_no_orphan_task ... ok1060test server_fns::projects::tests::enabling_tasks_only_inherits_rates_used_by_configured_projects ... ok1061test server_fns::projects::tests::members_can_list_identities_but_not_assignment_rates ... ok1062test server_fns::projects::tests::project_rate_helper_has_no_public_execute_grant ... ok1063test server_fns::projects::tests::managers_and_admins_can_read_assignment_rates ... ok1064test server_fns::projects::tests::project_rate_sql_matches_rust_for_missing_zero_and_present_sources ... ok1065test server_fns::time_entries::tests::a_limit_bounds_a_listing_on_its_own ... ok1066test server_fns::projects::tests::unknown_catalog_currency_requires_explicit_configured_rates_but_preserves_legacy ... ok1067test server_fns::reports::tests::filters_and_renames_keep_report_identity_and_totals ... ok1068test server_fns::time_entries::tests::a_reorder_rejects_foreign_missing_timed_and_duplicate_ids ... ok1069test server_fns::time_entries::tests::a_running_timer_cannot_be_moved_to_another_day ... ok1070test server_fns::time_entries::tests::an_unlimited_listing_needs_both_ends_of_the_range ... ok1071test server_fns::time_entries::tests::admin_may_log_time_without_assignment ... ok1072test server_fns::time_entries::tests::clamps_duration_against_the_snapped_start ... ok1073test server_fns::reports::tests::manager_report_omits_groups_containing_private_project_costs ... ok1074test server_fns::time_entries::tests::an_open_entry_can_move_into_a_day_with_locked_time ... ok1075test server_fns::time_entries::tests::assigned_member_may_log_time ... ok1076test server_fns::time_entries::tests::concurrent_timer_starts_insert_exactly_one_entry ... ok1077test server_fns::time_entries::tests::edits_preserve_archived_time_but_cannot_override_non_billability ... ok1078test server_fns::time_entries::tests::inactive_project_cannot_accept_new_time_even_for_admin ... ok1079test server_fns::reports::tests::report_uses_current_active_actor_and_tenant_for_every_filter ... ok1080test server_fns::time_entries::tests::rejects_out_of_range_start ... ok1081test server_fns::time_entries::tests::snaps_unaligned_start_to_the_grid ... ok1082test server_fns::time_entries::tests::moving_locked_time_rejects_the_entire_reorder ... ok1083test server_fns::time_entries::tests::new_time_and_picker_reject_inactive_or_foreign_contexts ... ok1084test server_fns::time_entries::tests::new_time_and_picker_require_a_project_task_link ... ok1085test server_fns::time_entries::tests::untimed_start_is_left_untouched ... ok1086test server_fns::time_entries::tests::submission_barrier_blocks_manual_entries_and_timer_starts ... ok1087test server_fns::time_entries::tests::submission_barrier_blocks_edits_and_cross_week_reorders ... ok1088test server_fns::reports::tests::same_names_keep_separate_groups_for_every_dimension ... ok1089test server_fns::time_entries::tests::new_time_uses_effective_billability_for_manual_entries_and_timers ... ok1090test server_fns::time_entries::tests::unassigned_member_is_forbidden ... ok1091test server_fns::time_entries::update_tests::competing_edit_that_restores_old_values_still_reports_a_change ... ok1092test server_fns::reports::tests::shared_person_and_task_are_partitioned_by_currency ... ok1093test server_fns::time_entries::update_tests::concurrent_lock_or_delete_is_rechecked_before_editing ... ok1094test server_fns::time_entries::update_tests::each_editable_field_changes_once_including_nulls ... ok1095test server_fns::time_entries::update_tests::competing_identical_edit_is_a_noop_after_the_first_commit ... ok1096test server_fns::time_entries::update_tests::effective_billability_noop_preserves_the_row ... ok1097test server_fns::time_entries::update_tests::normalized_noop_preserves_the_row_and_updated_at ... ok1098test server_fns::time_entries::update_tests::missing_foreign_and_locked_entries_are_not_noops ... ok1099test server_fns::time_entries::update_tests::restricted_empty_task_rejects_changes_and_noop_edits ... ok1100test server_fns::time_entries::update_tests::restricted_task_rejects_reschedule_and_delete ... ok1101test server_fns::time_entries::update_tests::restricted_empty_task_rejects_picker_manual_and_timer_starts ... ok1102test server_fns::time_entries::update_tests::assignment_cascade_allows_an_inflight_entry_project_fk_to_finish ... ok1103test server_fns::time_entries::update_tests::restricted_reordering_rejects_the_whole_batch ... ok1104test server_fns::time_entries::update_tests::revoked_grant_does_not_trap_an_own_running_timer ... ok1105test server_fns::time_entries::update_tests::restriction_changes_are_rechecked_before_manual_or_timer_insertion ... ok1106test server_fns::time_entries::update_tests::revoked_timer_stop_preserves_the_open_state_guard ... ok1107test server_fns::time_entries::update_tests::task_grants_allow_tracking_and_archived_history_for_every_role ... ok1108test server_fns::time_entries::update_tests::task_grant_revocation_committed_during_an_edit_is_rechecked ... ok1109test server_fns::reports::tests::tag_filters_keep_report_dimensions_and_details_in_sync ... ok1110test server_fns::users::tests::authority::access_transaction_holds_actor_authority_until_commit ... ok1111test server_fns::users::tests::authority::active_administrator_can_create_change_roles_and_deactivate ... ok1112test server_fns::users::tests::concurrency::access_changes_cannot_target_another_organization ... ok1113test server_fns::users::tests::authority::duplicate_creation_rolls_back_and_leaves_access_changes_usable ... ok1114test server_fns::users::tests::concurrency::concurrent_deactivations_keep_an_active_admin ... ok1115test server_fns::users::tests::concurrency::concurrent_demotions_keep_an_active_admin ... ok1116test server_fns::users::tests::concurrency::deactivation_and_demotion_keep_an_active_admin ... ok1117test server_fns::users::tests::concurrency::the_last_admin_cannot_be_demoted_or_deactivated ... ok1118test server_fns::users::tests::hide_rates_clears_both_rate_fields ... ok1119test server_fns::users::tests::authority::revoked_administrator_cannot_create_change_roles_or_deactivate ... ok1120test server_fns::users::tests::concurrency::demotion_and_deactivation_keep_an_active_admin ... ok1121test server_fns::users::tests::concurrency::unchanged_admin_access_is_allowed ... ok1122test server_fns::users::tests::authority::project_editor_and_user_revocation_commit_in_gate_order ... ok1123test server_fns::users::tests::authority::foreign_and_unknown_actors_cannot_change_local_user_access ... ok1124test server_fns::users::tests::authority::user_mutations_recheck_revocation_after_waiting_for_organization_lock ... ok1125test server_fns::users::tests::authority::user_mutations_wait_for_actor_revocation_and_recheck_after_commit ... ok11261127failures:11281129---- server_fns::importers::authorization_tests::job_endpoints_enforce_session_role_and_organization stdout ----1130Request ID: 01a11682-2bce-79b1-8515-65dd650585521131Request ID: 01a11682-2bd2-7ca0-b348-10b249cd02b211321133thread 'server_fns::importers::authorization_tests::job_endpoints_enforce_session_role_and_organization' (4760) panicked at crates/horae/src/server_fns/importers/authorization_tests/cli.rs:75:13:1134assertion `left == right` failed: ["import", "harvest-csv", "/build/.tmp7gjJqj/source.csv", "--dry-run"]: {"error":{"category":"indeterminate_submission","message":"Submission acknowledgement unavailable; resubmit identical input with the same request ID"},"operation":"import.harvest-csv","outcome":"error","request_id":"01a11682-2bd2-7ca0-b348-10b249cd02b2","version":1}1135 left: 61136 right: 1113711381139failures:1140 server_fns::importers::authorization_tests::job_endpoints_enforce_session_role_and_organization11411142test result: FAILED. 835 passed; 1 failed; 11 ignored; 0 measured; 0 filtered out; finished in 119.15s11431144error: test failed, to rerun pass `-p horae --bin horae`