nixbot

builds

numtide/horae build #251 failed

branch fix/user-mutation-authority · PR #228 · commit 6c67247e3f · · took 3h 6m · eval 14s

2 failed
failed attributes
status attribute duration
failed checks.aarch64-linux.e2e 1h 5m
vm-test-run-horae-e2e: !!! File "<string>", line 102, in wait_sql !!! server.wait_until_succeeds( !!! !!! RequestedAssertionFailed: action timed out afte …
vm-test-run-horae-e2e:
!!!   File "<string>", line 102, in wait_sql
!!!     server.wait_until_succeeds(
!!! 
!!! RequestedAssertionFailed: action timed out after 95.04 seconds (timeout=90)
cleanup
kill QemuMachine (pid 12)
server # qemu-system-aarch64: terminating on signal 15 from pid 6 (/nix/store/smwd56pl54f0pcjdspgh5vnf20c8xwsc-python3-3.13.13/bin/python3.13)
(finished: cleanup, in 0.10 seconds)
failed checks.aarch64-linux.tests 8m 59s
horae-tests-0.1.0: thread 'server_fns::importers::authorization_tests::job_endpoints_enforce_session_role_and_organization' (4760) panicked at crates/horae/src/ …
horae-tests-0.1.0:
thread 'server_fns::importers::authorization_tests::job_endpoints_enforce_session_role_and_organization' (4760) panicked at crates/horae/src/server_fns/importers/authorization_tests/cli.rs:75:13:
assertion `left == right` failed: ["import", "harvest-csv", "/build/.tmp7gjJqj/source.csv", "--dry-run"]: {"error":{"category":"indeterminate_submission","message":"Submission acknowledgement unavailable; resubmit identical input with the same request ID"},"operation":"import.harvest-csv","outcome":"error","request_id":"01a11682-2bd2-7ca0-b348-10b249cd02b2","version":1}
  left: 6
 right: 1
failures:
    server_fns::importers::authorization_tests::job_endpoints_enforce_session_role_and_organization
test result: FAILED. 835 passed; 1 failed; 11 ignored; 0 measured; 0 filtered out; finished in 119.15s
error: test failed, to rerun pass `-p horae --bin horae`
14 succeeded
succeeded attributes
status attribute duration
loading…
4 already built
skipped attributes
status attribute duration
loading…