setup
checks.aarch64-darwin.tests
· build #23
· raw
1this derivation will be built:2 /nix/store/1v942kxsn0lnva4pbkpgk3qdmwrwzvyq-horae-tests-0.1.0.drv3error: build of '/nix/store/1v942kxsn0lnva4pbkpgk3qdmwrwzvyq-horae-tests-0.1.0.drv' on 'grpc://farm.numtide.com:50051?client-cert=/run/secrets/vars/per-machine/bld1/nix-farm-ci/crt&client-key=/run/secrets/vars/per-machine/bld1/nix-farm-ci/key&connect-timeout=22&system=aarch64-darwin' failed: Cannot build '/nix/store/1v942kxsn0lnva4pbkpgk3qdmwrwzvyq-horae-tests-0.1.0.drv'.4 Reason: builder failed with exit code 101.5 Output paths:6 /nix/store/kikg9xll0gfvmbbql0447fw8znnjp5rn-horae-tests-0.1.07 Last 25 log lines:8 > test server_fns::users::tests::concurrency::unchanged_admin_access_is_allowed ... ok9 > test server_fns::users::tests::authority::duplicate_creation_rolls_back_and_leaves_access_changes_usable ... ok10 > test server_fns::users::tests::authority::foreign_and_unknown_actors_cannot_change_local_user_access ... ok11 > test server_fns::time_entries::update_tests::assignment_cascade_allows_an_inflight_entry_project_fk_to_finish ... ok12 > test server_fns::users::tests::authority::active_administrator_can_create_change_roles_and_deactivate ... ok13 > test server_fns::users::tests::authority::project_editor_and_user_revocation_commit_in_gate_order ... ok14 >15 > failures:16 >17 > ---- importers::harvest::engine_tests::completed_imports_allow_immediate_retries stdout ----18 >19 > thread 'importers::harvest::engine_tests::completed_imports_allow_immediate_retries' (87961684) panicked at crates/horae/src/importers/harvest/engine_tests.rs:133:14:20 > called `Result::unwrap()` on an `Err` value: error communicating with database: Socket is not connected (os error 57)21 >22 > Caused by:23 > Socket is not connected (os error 57)24 > note: run with `RUST_BACKTRACE=1` environment variable to display a backtrace25 >26 >27 > failures:28 > importers::harvest::engine_tests::completed_imports_allow_immediate_retries29 >30 > test result: FAILED. 835 passed; 1 failed; 10 ignored; 0 measured; 0 filtered out; finished in 85.02s31 >32 > error: test failed, to rerun pass `-p horae --bin horae`33 For full logs, run:34 nix log /nix/store/1v942kxsn0lnva4pbkpgk3qdmwrwzvyq-horae-tests-0.1.0.drv35error: Cannot build '/nix/store/1v942kxsn0lnva4pbkpgk3qdmwrwzvyq-horae-tests-0.1.0.drv'.36 Reason: builder failed with exit code 1.37 Output paths:38 /nix/store/kikg9xll0gfvmbbql0447fw8znnjp5rn-horae-tests-0.1.0