nixbot

builds

numtide/horae build #23 failed

branch fix/user-mutation-authority · PR #228 · commit 0e1e6759cf · · took 2h 31m · eval 20s

eval warnings 1 kind · 6 occurrences
  • warn Nixpkgs 26.05 will be the last release to support x86_64-darwin; see https://nixos.org/… ×6

6 failed
failed attributes
status attribute duration
failed checks.aarch64-darwin.e2e 57m 41s
setup: /nix/store/x68faxv7qs5pl8r2hmf57j7rj4vapyr2-closure-info.drv /nix/store/s64mr8w0j3jwjsiyg8xxsnkhzivk2nsi-run-nixos-vm.drv /nix/store/jyaqv3m36kpvf7 …
setup:
  /nix/store/x68faxv7qs5pl8r2hmf57j7rj4vapyr2-closure-info.drv
  /nix/store/s64mr8w0j3jwjsiyg8xxsnkhzivk2nsi-run-nixos-vm.drv
  /nix/store/jyaqv3m36kpvf7nmy06aqbq9m4zw93nq-nixos-vm.drv
  /nix/store/x51i1pkpam69x5v93wlg10vh4jcnamrw-driverConfiguration.json.drv
  /nix/store/6y7f1r52mfh0bvbcb7xxvhmr3hq978zl-nixos-test-driver-horae-e2e.drv
  /nix/store/anbj9wzh8k8zxw1s3y9xk9s6cw9wb1na-vm-test-run-horae-e2e.drv
Failed to find a machine for remote build!
derivation: anbj9wzh8k8zxw1s3y9xk9s6cw9wb1na-vm-test-run-horae-e2e.drv
required (system, features): (aarch64-darwin, [apple-virt, nixos-test])
12 available machines:
(systems, maxjobs, supportedFeatures, mandatoryFeatures)
([aarch64-darwin], 8, [big-parallel, kvm, nixos-test, uid-range], [])
([aarch64-darwin], 8, [big-parallel, kvm, nixos-test, uid-range], [])
([aarch64-darwin], 8, [big-parallel, kvm, nixos-test, uid-range], [])
([aarch64-darwin], 8, [big-parallel, kvm, nixos-test, uid-range], [])
([aarch64-linux], 8, [big-parallel, kvm, nixos-test, uid-range], [])
([aarch64-linux], 8, [big-parallel…
error: Cannot build '/nix/store/anbj9wzh8k8zxw1s3y9xk9s6cw9wb1na-vm-test-run-horae-e2e.drv'.
       Reason: platform mismatch
       Required system: 'aarch64-darwin'
       Current system: 'x86_64-linux'
       Reason: missing system features
       Required features: {apple-virt, nixos-test}
       Available features: {benchmark, big-parallel, ca-derivations, kvm, nixos-test, recursive-nix, uid-range}
failed checks.aarch64-darwin.e2e-oidc 52m 58s
setup: /nix/store/8cnggdi70b9lip6lar4dkn6ms1a85nn1-closure-info.drv /nix/store/36ir95hv695bk3w70r7h0ry6prp93zrd-run-nixos-vm.drv /nix/store/z6z8c11kdgs2ly …
setup:
  /nix/store/8cnggdi70b9lip6lar4dkn6ms1a85nn1-closure-info.drv
  /nix/store/36ir95hv695bk3w70r7h0ry6prp93zrd-run-nixos-vm.drv
  /nix/store/z6z8c11kdgs2lyk03qr3l231llgqi53a-nixos-vm.drv
  /nix/store/29ahnpign69203s5v0r5ip7c6c2zb8nb-driverConfiguration.json.drv
  /nix/store/p664ni9j57drpg7pyf7nrdc29pzql6z6-nixos-test-driver-horae-e2e-oidc.drv
  /nix/store/51895ix23bzs09aagkf5jakx0ycv21qs-vm-test-run-horae-e2e-oidc.drv
Failed to find a machine for remote build!
derivation: 51895ix23bzs09aagkf5jakx0ycv21qs-vm-test-run-horae-e2e-oidc.drv
required (system, features): (aarch64-darwin, [apple-virt, nixos-test])
12 available machines:
(systems, maxjobs, supportedFeatures, mandatoryFeatures)
([aarch64-darwin], 8, [big-parallel, kvm, nixos-test, uid-range], [])
([aarch64-darwin], 8, [big-parallel, kvm, nixos-test, uid-range], [])
([aarch64-darwin], 8, [big-parallel, kvm, nixos-test, uid-range], [])
([aarch64-darwin], 8, [big-parallel, kvm, nixos-test, uid-range], [])
([aarch64-linux], 8, [big-parallel, kvm, nixos-test, uid-range], [])
([aarch64-linux], 8, [big-par…
error: Cannot build '/nix/store/51895ix23bzs09aagkf5jakx0ycv21qs-vm-test-run-horae-e2e-oidc.drv'.
       Reason: platform mismatch
       Required system: 'aarch64-darwin'
       Current system: 'x86_64-linux'
       Reason: missing system features
       Required features: {apple-virt, nixos-test}
       Available features: {benchmark, big-parallel, ca-derivations, kvm, nixos-test, recursive-nix, uid-range}
failed checks.aarch64-darwin.pkgs-default 1h 10m
horae-0.1.0: 423.36s INFO Copying asset (1/6): /nix/var/nix/builds/nix-26492-3575913239/source/crates/horae/assets/css/horae-utils.css 423.36s INFO Copying as …
horae-0.1.0:
423.36s  INFO Copying asset (1/6): /nix/var/nix/builds/nix-26492-3575913239/source/crates/horae/assets/css/horae-utils.css
423.36s  INFO Copying asset (2/6): /nix/var/nix/builds/nix-26492-3575913239/source/target/dx/horae/release/web/public/wasm/horae_bg.wasm
423.36s  INFO Copying asset (3/6): /nix/var/nix/builds/nix-26492-3575913239/source/crates/horae/assets/css/horae.css
423.41s  INFO Copying asset (4/6): /nix/var/nix/builds/nix-26492-3575913239/source/crates/horae/assets/js/project-edit-navigation.js
423.41s  INFO Copying asset (5/6): /nix/var/nix/builds/nix-26492-3575913239/source/crates/horae/assets/js/menu.js
423.41s  INFO Copying asset (6/6): /nix/var/nix/builds/nix-26492-3575913239/source/target/dx/horae/release/web/public/wasm/horae.js
423.41s  INFO Client build completed successfully! 🚀 path="/nix/var/nix/builds/nix-26492-3575913239/source/target/dx/horae/release/web/public"
423.56s  INFO Compiled [1088/485]: extism
failed checks.aarch64-darwin.tests 37m 47s
horae-tests-0.1.0: called `Result::unwrap()` on an `Err` value: error communicating with database: Socket is not connected (os error 57) Caused by: Socket i …
horae-tests-0.1.0:
called `Result::unwrap()` on an `Err` value: error communicating with database: Socket is not connected (os error 57)
Caused by:
    Socket is not connected (os error 57)
note: run with `RUST_BACKTRACE=1` environment variable to display a backtrace
failures:
    importers::harvest::engine_tests::completed_imports_allow_immediate_retries
test result: FAILED. 835 passed; 1 failed; 10 ignored; 0 measured; 0 filtered out; finished in 85.02s
error: test failed, to rerun pass `-p horae --bin horae`
failed checks.aarch64-linux.e2e 8m 19s
vm-test-run-horae-e2e: ) ^ File "/nix/store/yv2q67grjgrymd498bgdfzlhyaj04cqv-nixos-test-driver-1.1/lib/python3.13/site-packages/test_driver/machine/__ …
vm-test-run-horae-e2e:
    )
    ^
  File "/nix/store/yv2q67grjgrymd498bgdfzlhyaj04cqv-nixos-test-driver-1.1/lib/python3.13/site-packages/test_driver/machine/__init__.py", line 878, in _execute
    self.connect()
    ~~~~~~~~~~~~^^
  File "/nix/store/yv2q67grjgrymd498bgdfzlhyaj04cqv-nixos-test-driver-1.1/lib/python3.13/site-packages/test_driver/machine/__init__.py", line 1057, in connect
    raise RuntimeError("Shell did not start in time")
RuntimeError: Shell did not start in time
failed checks.aarch64-linux.e2e-oidc 7m 56s
vm-test-run-horae-e2e-oidc: ) ^ File "/nix/store/yv2q67grjgrymd498bgdfzlhyaj04cqv-nixos-test-driver-1.1/lib/python3.13/site-packages/test_driver/machi …
vm-test-run-horae-e2e-oidc:
    )
    ^
  File "/nix/store/yv2q67grjgrymd498bgdfzlhyaj04cqv-nixos-test-driver-1.1/lib/python3.13/site-packages/test_driver/machine/__init__.py", line 878, in _execute
    self.connect()
    ~~~~~~~~~~~~^^
  File "/nix/store/yv2q67grjgrymd498bgdfzlhyaj04cqv-nixos-test-driver-1.1/lib/python3.13/site-packages/test_driver/machine/__init__.py", line 1057, in connect
    raise RuntimeError("Shell did not start in time")
RuntimeError: Shell did not start in time
17 succeeded
succeeded attributes
status attribute duration
loading…
6 already built
skipped attributes
status attribute duration
loading…