horae-tests-0.1.0
checks.aarch64-linux.tests
· build #225
· raw
1elastic-arm-779dd3ca: building bnvx2niqngghy4ai71c0fmxx0d342ib9-horae-tests-0.1.0.drv
unpackPhase
2unpacking source archive /nix/store/ghwi5li5sfva0lpq13519xp5icqcrnm7-source3source root is sourcepatchPhase
4Executing configureCargoCommonVars5decompressing cargo artifacts from /nix/store/iz15gsb1vnxn8iiqaks5c263ms6mxl74-horae-checks-deps-0.1.0/target.tar.zst to targetconfigurePhase
6will append /build/source/.cargo-home/config.toml with contents of /nix/store/kqxgprj432hnlh0pqlk1779vyabfmw4i-vendor-cargo-deps/config.toml7default configurePhase, nothing to dobuildPhase
8+++ command cargo nextest run -p horae-core9 Compiling proc-macro2 v1.0.10610 Compiling serde_core v1.0.22811 Compiling serde v1.0.22812 Compiling num-traits v0.2.1913 Compiling quote v1.0.4614 Compiling syn v2.0.11815 Compiling uuid v1.23.416 Compiling serde_derive v1.0.22817 Compiling thiserror-impl v2.0.1818 Compiling thiserror v2.0.1819 Compiling chrono v0.4.4520 Compiling horae-core v0.1.0 (/build/source/crates/core)21 Finished `test` profile [unoptimized + debuginfo] target(s) in 10.92s22------------23 Nextest run ID 37b4edd4-85d1-4f7a-94d3-55facd64f68f with nextest profile: default24 Starting 189 tests across 1 binary25 Running [ 00:00:00] 0/189: 8 running, 0 passed, 0 skipped 26 [ 00:00:00] horae-core ed_alert_threshold_is_exact_without_rounding27 [ 00:00:00] horae-core ::a_single_jump_announces_every_crossed_band28 [ 00:00:00] horae-core ert_accepts_zero_percent_but_not_zero_budget29 [ 00:00:00] horae-core jects_invalid_inputs_and_widens_large_values30 [ 00:00:00] horae-core percentage_rounds_clamps_and_never_overflows31 [ 00:00:00] horae-core ::tests::current_band_is_the_highest_reached32 [ 00:00:00] horae-core dget::tests::each_crossing_is_announced_once33 Running [ 00:00:00] ==> 52/189: 8 running, 0 passed, 0 skipped 34 [ 00:00:00] horae-core ed_alert_threshold_is_exact_without_rounding35 [ 00:00:00] horae-core ::a_single_jump_announces_every_crossed_band36 [ 00:00:00] horae-core ert_accepts_zero_percent_but_not_zero_budget37 [ 00:00:00] horae-core jects_invalid_inputs_and_widens_large_values38 [ 00:00:00] horae-core percentage_rounds_clamps_and_never_overflows39 [ 00:00:00] horae-core ::tests::current_band_is_the_highest_reached40 [ 00:00:00] horae-core dget::tests::each_crossing_is_announced_once41 PASS [ 0.005s] horae-core budget::tests::configured_alert_accepts_zero_percent_but_not_zero_budget42 PASS [ 0.005s] horae-core budget::tests::configured_alert_rejects_invalid_inputs_and_widens_large_values43 PASS [ 0.007s] horae-core budget::tests::configured_alert_threshold_is_exact_without_rounding44 PASS [ 0.007s] horae-core budget::tests::drop_below_a_band_does_not_fire_but_current_resets45 PASS [ 0.008s] horae-core budget::tests::a_single_jump_announces_every_crossed_band46 PASS [ 0.008s] horae-core budget::tests::display_percentage_rounds_clamps_and_never_overflows47 PASS [ 0.008s] horae-core budget::tests::current_band_is_the_highest_reached48 PASS [ 0.005s] horae-core budget::tests::over_budget_fires_even_without_a_configured_100_band49 PASS [ 0.006s] horae-core budget::tests::no_band_for_zero_or_missing_budget50 PASS [ 0.011s] horae-core budget::tests::each_crossing_is_announced_once51 PASS [ 0.006s] horae-core budget::tests::large_values_do_not_overflow52 PASS [ 0.005s] horae-core client::tests::default_rate_preserves_absence_zero_and_exact_large_amounts53 PASS [ 0.004s] horae-core client::tests::default_rate_rejects_negative_fractional_cent_overflow_and_invalid_text54 PASS [ 0.004s] horae-core client::tests::profile_accepts_supported_currencies_and_unicode_character_limit55 PASS [ 0.004s] horae-core duration::tests::format_hhmm_pads_minutes56 PASS [ 0.009s] horae-core client::tests::optional_text_normalizes_only_blank_fields57 PASS [ 0.005s] horae-core client::tests::profile_rejects_unsupported_currency_and_null_billing_fields58 PASS [ 0.007s] horae-core client::tests::profile_rejects_blank_overlong_and_null_names59 PASS [ 0.008s] horae-core duration::tests::minutes_between_is_exact_no_minimum60 PASS [ 0.006s] horae-core duration::tests::parse_colon61 PASS [ 0.009s] horae-core duration::tests::format_clamps_negative_to_zero62 PASS [ 0.005s] horae-core duration::tests::parse_preserves_u32_boundary_without_saturating63 PASS [ 0.011s] horae-core duration::tests::format_round_trip64 PASS [ 0.007s] horae-core duration::tests::parse_decimal65 PASS [ 0.005s] horae-core duration::tests::parse_rejects_colon_overflow_without_panicking66 PASS [ 0.004s] horae-core duration::tests::parse_rejects_excessive_decimal_precision_and_numerator67 PASS [ 0.004s] horae-core duration::tests::parse_rejects_negative_non_finite_and_malformed_values68 Running [ 00:00:00] ==> 54/189: 8 running, 54 passed, 0 skipped 69 [ 00:00:00] horae-core s::conversion_matches_exact_scaled_rationals70 [ 00:00:00] horae-core ts::time_entry_key_distinguishes_and_matches71 [ 00:00:00] horae-core quires_binding_and_no_imports_or_active_work72 [ 00:00:00] horae-core tests::import_modes_display_their_wire_names73 [ 00:00:00] horae-core s_when_errored_counts_match_collected_errors74 [ 00:00:00] horae-core conserves_header_amount_and_bounds_each_line75 [ 00:00:00] horae-core cation_handles_empty_zero_and_full_discounts76 PASS [ 0.008s] horae-core duration::tests::parse_decimal_rounds_half_minutes_exactly77 PASS [ 0.005s] horae-core importers::harvest::convert::tests::conversion_handles_high_precision_without_intermediate_overflow78 PASS [ 0.004s] horae-core importers::harvest::convert::tests::garbage_is_rejected79 PASS [ 0.005s] horae-core importers::harvest::convert::tests::conversion_rejects_unrepresentable_scaled_values_without_panicking80 PASS [ 0.005s] horae-core importers::harvest::convert::tests::high_precision_fraction_straddles_the_half_minute_exactly81 PASS [ 0.006s] horae-core importers::harvest::convert::tests::conversion_preserves_the_i64_boundary_and_rejects_rounding_past_it82 PASS [ 0.010s] horae-core duration::tests::parse_round_trips_each_minute_in_a_day83 PASS [ 0.004s] horae-core importers::harvest::convert::tests::hours_common_values_are_exact84 PASS [ 0.005s] horae-core importers::harvest::convert::tests::money_common_values_are_exact85 PASS [ 0.010s] horae-core importers::harvest::convert::tests::conversion_reports_precision_and_numerator_limits86 PASS [ 0.007s] horae-core importers::harvest::convert::tests::money_rounds_third_decimal_half_up87 PASS [ 0.006s] horae-core importers::harvest::convert::tests::negative_is_rejected88 PASS [ 0.009s] horae-core importers::harvest::convert::tests::leading_and_trailing_forms_parse89 PASS [ 0.008s] horae-core importers::harvest::convert::tests::money_round_trip_against_exporter_transform90 PASS [ 0.010s] horae-core importers::harvest::convert::tests::hours_round_trip_against_exporter_transform91 PASS [ 0.004s] horae-core importers::harvest::keys::tests::client_key_equal_across_case_and_whitespace92 PASS [ 0.006s] horae-core importers::harvest::convert::tests::round_half_up_at_the_boundary93 PASS [ 0.004s] horae-core importers::harvest::keys::tests::occurrence_counter_keys_are_independent94 PASS [ 0.005s] horae-core importers::harvest::keys::tests::composite_components_do_not_collide95 PASS [ 0.005s] horae-core importers::harvest::keys::tests::normalize_matches_sql_harvest_norm_contract96 PASS [ 0.005s] horae-core importers::harvest::keys::tests::occurrence_counter_numbers_repeats_from_zero97 PASS [ 0.006s] horae-core importers::harvest::keys::tests::project_key_falls_back_to_client_and_name98 PASS [ 0.005s] horae-core importers::harvest::keys::tests::project_key_prefers_code_when_present99 PASS [ 0.008s] horae-core importers::harvest::keys::tests::normalize_trims_and_case_folds100 PASS [ 0.005s] horae-core importers::harvest::keys::tests::task_key_shared_across_projects101 Running [ 00:00:00] ==> 54/189: 8 running, 54 passed, 0 skipped 102 [ 00:00:00] horae-core s::conversion_matches_exact_scaled_rationals103 [ 00:00:00] horae-core ts::time_entry_key_distinguishes_and_matches104 [ 00:00:00] horae-core quires_binding_and_no_imports_or_active_work105 [ 00:00:00] horae-core tests::import_modes_display_their_wire_names106 [ 00:00:00] horae-core s_when_errored_counts_match_collected_errors107 [ 00:00:00] horae-core conserves_header_amount_and_bounds_each_line108 [ 00:00:00] horae-core cation_handles_empty_zero_and_full_discounts109 PASS [ 0.004s] horae-core importers::harvest::types::tests::does_not_reconcile_when_an_errored_count_has_no_reported_error110 PASS [ 0.006s] horae-core importers::harvest::types::tests::archived_errors_and_new_inline_errors_reconcile_across_batches111 Running [ 00:00:00] ==> 54/189: 8 running, 54 passed, 0 skipped 112 [ 00:00:00] horae-core s::conversion_matches_exact_scaled_rationals113 [ 00:00:00] horae-core ts::time_entry_key_distinguishes_and_matches114 [ 00:00:00] horae-core quires_binding_and_no_imports_or_active_work115 [ 00:00:00] horae-core tests::import_modes_display_their_wire_names116 [ 00:00:00] horae-core s_when_errored_counts_match_collected_errors117 [ 00:00:00] horae-core conserves_header_amount_and_bounds_each_line118 [ 00:00:00] horae-core cation_handles_empty_zero_and_full_discounts119 Running [ 00:00:00] =====> 107/189: 8 running, 54 passed, 0 skipped 120 [ 00:00:00] horae-core s::conversion_matches_exact_scaled_rationals121 [ 00:00:00] horae-core ts::time_entry_key_distinguishes_and_matches122 [ 00:00:00] horae-core quires_binding_and_no_imports_or_active_work123 [ 00:00:00] horae-core tests::import_modes_display_their_wire_names124 [ 00:00:00] horae-core s_when_errored_counts_match_collected_errors125 [ 00:00:00] horae-core conserves_header_amount_and_bounds_each_line126 [ 00:00:00] horae-core cation_handles_empty_zero_and_full_discounts127 PASS [ 0.008s] horae-core importers::harvest::keys::tests::time_entry_key_distinguishes_and_matches128 PASS [ 0.005s] horae-core importers::harvest::types::tests::reconciles_when_errored_counts_match_collected_errors129 PASS [ 0.011s] horae-core importers::harvest::types::account_switch_tests::account_switch_requires_binding_and_no_imports_or_active_work130 PASS [ 0.009s] horae-core importers::harvest::types::tests::import_modes_display_their_wire_names131 PASS [ 0.005s] horae-core invoice::tests::discount_allocation_rejects_negative_lines_and_subtotal_overflow132 PASS [ 0.007s] horae-core invoice::tests::discount_allocation_conserves_header_amount_and_bounds_each_line133 PASS [ 0.004s] horae-core invoice::tests::discount_allocation_uses_largest_remainder_then_stable_source_order134 PASS [ 0.006s] horae-core invoice::tests::discount_allocation_handles_empty_zero_and_full_discounts135 PASS [ 0.005s] horae-core invoice::tests::discount_allocation_supports_maximum_representable_subtotal136 PASS [ 0.004s] horae-core invoice::tests::invoice_adjustments_round_components_half_up137 PASS [ 0.004s] horae-core invoice::tests::invoice_adjustments_apply_discount_before_non_compounding_taxes138 PASS [ 0.004s] horae-core invoice::tests::invoice_adjustments_reject_negative_subtotal_and_overflow139 PASS [ 0.004s] horae-core invoice::tests::line_amount_accepts_large_representable_amounts140 PASS [ 0.007s] horae-core invoice::tests::discounted_fee_contribution_leaves_discount_available141 PASS [ 0.004s] horae-core invoice::tests::line_amount_odd_minutes142 PASS [ 0.007s] horae-core invoice::tests::line_amount_exact_hour143 PASS [ 0.008s] horae-core invoice::tests::line_amount_90_minutes144 PASS [ 0.007s] horae-core invoice::tests::line_amount_half_hour145 PASS [ 0.006s] horae-core invoice::tests::line_amount_rounds_half_cents_up_not_to_even146 PASS [ 0.006s] horae-core invoice::tests::line_amount_zero_minutes147 PASS [ 0.011s] horae-core invoice::tests::line_amount_rejects_unrepresentable_results148 PASS [ 0.007s] horae-core invoice::tests::line_amount_zero_rate149 PASS [ 0.006s] horae-core invoice::tests::selected_rate_keeps_zero_and_explicit_missing_project_rate150 PASS [ 0.007s] horae-core invoice::tests::resolve_rate_cascade151 PASS [ 0.005s] horae-core money::tests::addition_rejects_overflow_in_both_directions152 PASS [ 0.005s] horae-core invoice::tests::selected_rate_mode_ignores_unselected_rate_sources153 Running [ 00:00:00] ====> 108/189: 7 running, 108 passed, 0 skipped 154 [ 00:00:00] horae-core s::conversion_matches_exact_scaled_rationals155 [ 00:00:00] horae-core h_valid_grant_pair_and_its_revoked_selection156 [ 00:00:00] horae-core d_scopes_but_not_write_or_expense_management157 [ 00:00:00] horae-core sts::catalog_has_fifty_distinct_known_grants158 [ 00:00:00] horae-core ce_edges_without_extra_cross_resource_grants159 [ 00:00:00] horae-core e_defaults_match_the_known_reference_catalog160 [ 00:00:00] horae-core tests::empty_selection_includes_member_floor161 PASS [ 0.005s] horae-core money::tests::addition_retains_currency_checks_and_representable_boundaries162 PASS [ 0.004s] horae-core money::tests::parse_cents_reads_whole_and_fractional_amounts163 PASS [ 0.004s] horae-core money::tests::format_cents_groups_thousands_and_keeps_sign164 PASS [ 0.005s] horae-core money::tests::parse_cents_tolerates_grouping_spaces_and_signs165 PASS [ 0.006s] horae-core money::tests::parse_cents_is_exact_where_a_float_would_drift166 PASS [ 0.009s] horae-core money::tests::parse_cents_rejects_what_it_cannot_represent167 PASS [ 0.009s] horae-core permissions::approvals::tests::all_records_need_approval_scope_even_when_both_domains_are_readable168 PASS [ 0.006s] horae-core permissions::approvals::tests::catalog_grants_cannot_substitute_for_approval169 PASS [ 0.005s] horae-core permissions::approvals::tests::expense_read_scope_and_approval_scope_form_an_intersection170 PASS [ 0.005s] horae-core permissions::approvals::tests::inactive_and_foreign_provenance_deny_even_with_all_grants171 PASS [ 0.012s] horae-core money::tests::format_cents_plain_keeps_sign_below_one_unit172 PASS [ 0.004s] horae-core permissions::approvals::tests::missing_dimensions_and_input_duplicates_do_not_infer_scope173 PASS [ 0.004s] horae-core permissions::approvals::tests::reevaluation_does_not_reuse_prior_read_or_approval_success174 PASS [ 0.011s] horae-core permissions::approvals::tests::empty_record_sets_do_not_remove_identity_or_explicit_grant_checks175 PASS [ 0.005s] horae-core permissions::approvals::tests::no_expense_read_is_needed_when_there_are_no_expenses176 PASS [ 0.006s] horae-core permissions::approvals::tests::removing_the_last_matching_relationship_revokes_both_domains177 PASS [ 0.005s] horae-core permissions::catalog::stored_tests::rejects_duplicate_grants_instead_of_silently_deduplicating178 PASS [ 0.008s] horae-core permissions::approvals::tests::only_expense_reads_or_their_write_prerequisites_make_others_expenses_visible179 PASS [ 0.008s] horae-core permissions::approvals::tests::one_unreadable_expense_denies_the_whole_supplied_set180 PASS [ 0.005s] horae-core permissions::catalog::stored_tests::rejects_every_missing_prerequisite_without_repairing_input181 PASS [ 0.005s] horae-core permissions::catalog::stored_tests::rejects_empty_saved_selection_instead_of_adding_member_floor182 PASS [ 0.006s] horae-core permissions::catalog::stored_tests::rejects_each_missing_floor_grant183 PASS [ 0.006s] horae-core permissions::catalog::stored_tests::rejects_unsupported_versions_even_for_valid_grants184 PASS [ 0.005s] horae-core permissions::catalog::stored_tests::restores_each_builtin_selection_without_changing_grants185 Running [ 00:00:00] ====> 108/189: 7 running, 108 passed, 0 skipped 186 [ 00:00:00] horae-core s::conversion_matches_exact_scaled_rationals187 [ 00:00:00] horae-core h_valid_grant_pair_and_its_revoked_selection188 [ 00:00:00] horae-core d_scopes_but_not_write_or_expense_management189 [ 00:00:00] horae-core sts::catalog_has_fifty_distinct_known_grants190 [ 00:00:00] horae-core ce_edges_without_extra_cross_resource_grants191 [ 00:00:00] horae-core e_defaults_match_the_known_reference_catalog192 [ 00:00:00] horae-core tests::empty_selection_includes_member_floor193 PASS [ 0.004s] horae-core permissions::catalog::tests::adding_all_catalog_grants_produces_exactly_the_catalog194 PASS [ 0.008s] horae-core permissions::catalog::stored_tests::restores_custom_selection_without_reapplying_profile_defaults195 PASS [ 0.005s] horae-core permissions::catalog::tests::administrator_selection_covers_known_catalog_without_unknown_ids196 PASS [ 0.008s] horae-core permissions::catalog::stored_tests::stored_order_does_not_change_the_selected_set197 Running [ 00:00:00] ====> 108/189: 7 running, 108 passed, 0 skipped 198 [ 00:00:00] horae-core s::conversion_matches_exact_scaled_rationals199 [ 00:00:00] horae-core h_valid_grant_pair_and_its_revoked_selection200 [ 00:00:00] horae-core d_scopes_but_not_write_or_expense_management201 [ 00:00:00] horae-core sts::catalog_has_fifty_distinct_known_grants202 [ 00:00:00] horae-core ce_edges_without_extra_cross_resource_grants203 [ 00:00:00] horae-core e_defaults_match_the_known_reference_catalog204 [ 00:00:00] horae-core tests::empty_selection_includes_member_floor205 Running [ 00:00:00] ======> 154/189: 7 running, 108 passed, 0 skipped 206 [ 00:00:00] horae-core s::conversion_matches_exact_scaled_rationals207 [ 00:00:00] horae-core h_valid_grant_pair_and_its_revoked_selection208 [ 00:00:00] horae-core d_scopes_but_not_write_or_expense_management209 [ 00:00:00] horae-core sts::catalog_has_fifty_distinct_known_grants210 [ 00:00:00] horae-core ce_edges_without_extra_cross_resource_grants211 [ 00:00:00] horae-core e_defaults_match_the_known_reference_catalog212 [ 00:00:00] horae-core tests::empty_selection_includes_member_floor213 PASS [ 0.077s] horae-core importers::harvest::convert::tests::conversion_matches_exact_scaled_rationals214 PASS [ 0.005s] horae-core permissions::catalog::tests::catalog_has_fifty_distinct_known_grants215 PASS [ 0.007s] horae-core permissions::catalog::tests::approve_all_includes_read_scopes_but_not_write_or_expense_management216 PASS [ 0.005s] horae-core permissions::catalog::tests::direct_profile_defaults_match_the_known_reference_catalog217 PASS [ 0.006s] horae-core permissions::catalog::tests::dependency_graph_matches_the_reference_edges_without_extra_cross_resource_grants218 PASS [ 0.005s] horae-core permissions::catalog::tests::empty_selection_includes_member_floor219 PASS [ 0.005s] horae-core permissions::catalog::tests::floor_cannot_be_removed_or_partially_modified220 PASS [ 0.005s] horae-core permissions::catalog::tests::every_profile_includes_floor_and_is_closed_under_dependencies221 PASS [ 0.006s] horae-core permissions::catalog::tests::member_has_only_own_time_and_expense_access222 PASS [ 0.006s] horae-core permissions::catalog::tests::every_declared_dependency_is_added_and_removing_it_removes_the_dependent223 PASS [ 0.008s] horae-core permissions::catalog::tests::finance_profiles_cannot_edit_rates_and_project_manager_has_no_financial_grants224 PASS [ 0.004s] horae-core permissions::catalog::tests::profiles_reject_legacy_rank_names_and_unknown_values225 PASS [ 0.005s] horae-core permissions::catalog::tests::removing_absent_permission_is_an_idempotent_no_op226 PASS [ 0.012s] horae-core permissions::catalog::tests::known_permission_name_decodes_without_legacy_role_conversion227 PASS [ 0.005s] horae-core permissions::catalog::tests::removing_managed_time_read_also_removes_all_reads_writes_and_approvals228 PASS [ 0.004s] horae-core permissions::catalog::tests::report_and_withdrawal_grants_do_not_add_unrelated_authority229 PASS [ 0.008s] horae-core permissions::catalog::tests::removing_invoice_draft_write_keeps_read_but_removes_managed_and_all_write230 PASS [ 0.007s] horae-core permissions::catalog::tests::removing_one_financial_permission_preserves_unrelated_families231 PASS [ 0.004s] horae-core permissions::catalog::tests::template_names_reject_empty_and_overlong_unicode_names232 PASS [ 0.005s] horae-core permissions::catalog::tests::template_names_trim_without_changing_display_or_internal_spaces233 PASS [ 0.004s] horae-core permissions::catalog::tests::unknown_permission_names_are_rejected234 PASS [ 0.005s] horae-core permissions::person_management::tests::combined_unrelated_grants_do_not_create_person_management_eligibility235 PASS [ 0.005s] horae-core permissions::person_management::tests::each_catalog_grant_has_the_specified_compatibility_without_changing_grants236 Running [ 00:00:00] ======> 155/189: 8 running, 155 passed, 0 skipped 237 [ 00:00:00] horae-core mpotent_order_independent_and_duplicate_free238 [ 00:00:00] horae-core rmissions::tests::scope_union_obeys_set_laws239 [ 00:00:00] horae-core cept_supported_currencies_and_optional_dates240 [ 00:00:00] horae-core ests::basics_reject_blank_and_overlong_names241 [ 00:00:00] horae-core eject_overlong_code_and_unsupported_currency242 [ 00:00:00] horae-core ct_missing_overlong_and_excessive_milestones243 [ 00:00:00] horae-core hedules_validate_amounts_and_milestone_total244 PASS [ 0.004s] horae-core permissions::person_management::tests::other_people_and_empty_removal_need_neither_grants_nor_a_separate_actor245 PASS [ 0.006s] horae-core permissions::person_management::tests::eligibility_tracks_last_compatible_grant_loss_and_restoration246 PASS [ 0.017s] horae-core permissions::catalog::tests::removing_any_non_floor_grant_keeps_the_remaining_selection_closed247 PASS [ 0.006s] horae-core permissions::person_management::tests::self_link_rejects_the_proposal_in_every_position_without_filtering_it248 PASS [ 0.005s] horae-core permissions::rates::tests::billable_actions_use_only_their_own_grant_and_owner_scope249 PASS [ 0.006s] horae-core permissions::rates::tests::all_six_defaults_have_the_approved_financial_access250 PASS [ 0.006s] horae-core permissions::rates::tests::billable_owner_never_uses_the_other_management_dimension251 PASS [ 0.010s] horae-core permissions::person_management::tests::own_tracking_floor_does_not_qualify252 PASS [ 0.005s] horae-core permissions::rates::tests::explicit_rate_edits_require_write_even_for_zero_or_an_equal_value253 PASS [ 0.005s] horae-core permissions::rates::tests::grant_removal_denies_without_mutating_the_remaining_selection254 PASS [ 0.006s] horae-core permissions::rates::tests::cost_and_billable_grants_are_independent_and_read_does_not_allow_write255 PASS [ 0.004s] horae-core permissions::rates::tests::removing_read_prerequisites_denies_both_actions256 PASS [ 0.007s] horae-core permissions::rates::tests::identity_and_tenant_mismatches_deny_even_all_financial_grants257 PASS [ 0.007s] horae-core permissions::rates::tests::read_only_cost_grant_cannot_authorize_an_explicit_rate_edit258 PASS [ 0.004s] horae-core permissions::rates::tests::unrelated_catalog_grants_never_authorize_ordinary_financial_fields259 PASS [ 0.024s] horae-core permissions::person_management::tests::any_compatible_grant_suffices_in_every_pair260 PASS [ 0.004s] horae-core permissions::tests::assignments_do_not_grant_scope_and_missing_assignments_do_not_match261 PASS [ 0.009s] horae-core permissions::rates::tests::unchanged_rate_edit_requires_no_financial_write_grant262 PASS [ 0.056s] horae-core permissions::catalog::stored_tests::restores_each_valid_grant_pair_and_its_revoked_selection263 PASS [ 0.006s] horae-core permissions::tests::every_scope_combination_matches_only_explicitly_granted_dimensions264 PASS [ 0.006s] horae-core permissions::tests::inactive_or_foreign_context_is_denied_for_every_scope_combination265 PASS [ 0.007s] horae-core permissions::tests::assignment_matching_searches_all_members_and_is_insensitive_to_duplicates266 PASS [ 0.005s] horae-core permissions::tests::removing_an_assignment_removes_only_that_matching_dimension267 Running [ 00:00:00] ======> 155/189: 8 running, 155 passed, 0 skipped 268 [ 00:00:00] horae-core mpotent_order_independent_and_duplicate_free269 [ 00:00:00] horae-core rmissions::tests::scope_union_obeys_set_laws270 [ 00:00:00] horae-core cept_supported_currencies_and_optional_dates271 [ 00:00:00] horae-core ests::basics_reject_blank_and_overlong_names272 [ 00:00:00] horae-core eject_overlong_code_and_unsupported_currency273 [ 00:00:00] horae-core ct_missing_overlong_and_excessive_milestones274 [ 00:00:00] horae-core hedules_validate_amounts_and_milestone_total275 PASS [ 0.004s] horae-core project::tests::basics_accept_same_day_but_reject_reversed_dates276 Running [ 00:00:00] ======> 155/189: 8 running, 155 passed, 0 skipped 277 [ 00:00:00] horae-core mpotent_order_independent_and_duplicate_free278 [ 00:00:00] horae-core rmissions::tests::scope_union_obeys_set_laws279 [ 00:00:00] horae-core cept_supported_currencies_and_optional_dates280 [ 00:00:00] horae-core ests::basics_reject_blank_and_overlong_names281 [ 00:00:00] horae-core eject_overlong_code_and_unsupported_currency282 [ 00:00:00] horae-core ct_missing_overlong_and_excessive_milestones283 [ 00:00:00] horae-core hedules_validate_amounts_and_milestone_total284 PASS [ 0.005s] horae-core project::tests::basics_accept_supported_currencies_and_optional_dates285 PASS [ 0.005s] horae-core project::tests::fee_schedules_reject_missing_overlong_and_excessive_milestones286 PASS [ 0.005s] horae-core project::tests::fee_schedules_validate_amounts_and_milestone_total287 PASS [ 0.052s] horae-core permissions::catalog::tests::normalization_is_idempotent_order_independent_and_duplicate_free288 PASS [ 0.006s] horae-core project::tests::monetary_budgets_are_only_available_for_time_and_materials289 PASS [ 0.011s] horae-core permissions::tests::scope_union_obeys_set_laws290 PASS [ 0.004s] horae-core project::tests::monthly_fee_dates_follow_calendar_months291 PASS [ 0.010s] horae-core project::tests::basics_reject_blank_and_overlong_names292 PASS [ 0.005s] horae-core project::tests::monthly_fee_dates_reject_invalid_calendar_inputs293 PASS [ 0.010s] horae-core project::tests::basics_reject_overlong_code_and_unsupported_currency294 PASS [ 0.005s] horae-core project::tests::payment_terms_support_receipt_and_checked_days295 PASS [ 0.004s] horae-core rounding::tests::nearest_ties_round_up296 PASS [ 0.006s] horae-core project::tests::percentage_rejects_invalid_precision_range_and_syntax297 PASS [ 0.005s] horae-core rounding::tests::result_is_multiple_of_inc298 PASS [ 0.007s] horae-core project::tests::percentage_preserves_exact_hundredths299 PASS [ 0.004s] horae-core state::tests::invoiced_is_final300 PASS [ 0.005s] horae-core rounding::tests::up_and_down301 PASS [ 0.010s] horae-core rounding::tests::effective_minutes_respect_frozen_history_including_zero302 PASS [ 0.004s] horae-core time_of_day::tests::clamp_to_day_prevents_crossing_midnight303 PASS [ 0.011s] horae-core rounding::tests::identity_when_inc_zero304 PASS [ 0.006s] horae-core state::tests::member_submit_and_reopen305 PASS [ 0.005s] horae-core state::tests::only_manager_can_approve306 PASS [ 0.006s] horae-core time_of_day::tests::format_round_trips307 PASS [ 0.006s] horae-core time_of_day::tests::format_12h_matches_harvest_style308 PASS [ 0.008s] horae-core state::tests::managers_invoice_open_and_approved_time309 PASS [ 0.005s] horae-core time_of_day::tests::parse_reads_24h310 PASS [ 0.007s] horae-core time_of_day::tests::snap_rounds_to_nearest_step311 PASS [ 0.007s] horae-core time_of_day::tests::parse_rejects_out_of_range_and_garbage312 Running [ 00:00:00] ======== 189/189: 8 running, 155 passed, 0 skipped 313 [ 00:00:00] horae-core mpotent_order_independent_and_duplicate_free314 [ 00:00:00] horae-core rmissions::tests::scope_union_obeys_set_laws315 [ 00:00:00] horae-core cept_supported_currencies_and_optional_dates316 [ 00:00:00] horae-core ests::basics_reject_blank_and_overlong_names317 [ 00:00:00] horae-core eject_overlong_code_and_unsupported_currency318 [ 00:00:00] horae-core ct_missing_overlong_and_excessive_milestones319 [ 00:00:00] horae-core hedules_validate_amounts_and_milestone_total320 PASS [ 0.007s] horae-core types::tests::budget_kind_wire_strings_match_db_enum321 PASS [ 0.006s] horae-core week::tests::configured_week_reports_an_unrepresentable_start322 PASS [ 0.007s] horae-core week::tests::configured_week_can_start_in_the_previous_year323 PASS [ 0.007s] horae-core week::tests::configured_week_contains_each_day_for_all_seven_start_days324 PASS [ 0.010s] horae-core time_of_day::tests::parse_reads_12h_including_edges325 PASS [ 0.008s] horae-core week::tests::maps_any_weekday_to_its_monday326------------327 Summary [ 0.180s] 189 tests run: 189 passed, 0 skipped328 Running [ 00:00:00] ======== 189/189: 8 running, 155 passed, 0 skipped 329 [ 00:00:00] horae-core mpotent_order_independent_and_duplicate_free330 [ 00:00:00] horae-core rmissions::tests::scope_union_obeys_set_laws331 [ 00:00:00] horae-core cept_supported_currencies_and_optional_dates332 [ 00:00:00] horae-core ests::basics_reject_blank_and_overlong_names333 [ 00:00:00] horae-core eject_overlong_code_and_unsupported_currency334 [ 00:00:00] horae-core ct_missing_overlong_and_excessive_milestones335 [ 00:00:00] horae-core hedules_validate_amounts_and_milestone_total336The files belonging to this database system will be owned by user "nixbld".337This user must also own the server process.338339The database cluster will be initialized with locale "C".340The default text search configuration will be set to "english".341342Data page checksums are disabled.343344fixing permissions on existing directory /build/tmp.sNojg2uLu1 ... ok345creating subdirectories ... ok346selecting dynamic shared memory implementation ... posix347selecting default "max_connections" ... 100348selecting default "shared_buffers" ... 128MB349selecting default time zone ... UTC350creating configuration files ... ok351running bootstrap script ... ok352performing post-bootstrap initialization ... ok353syncing data to disk ... ok354355initdb: warning: enabling "trust" authentication for local connections356initdb: hint: You can change this by editing pg_hba.conf or using the option -A, or --auth-local and --auth-host, the next time you run initdb.357358Success. You can now start the database server using:359360 pg_ctl -D /build/tmp.sNojg2uLu1 -l logfile start361362waiting for server to start.... done363server started364+++ command cargo test -p horae --features server365 Compiling horae v0.1.0 (/build/source/crates/horae)366 Compiling horae-core v0.1.0 (/build/source/crates/core)367 Finished `test` profile [unoptimized + debuginfo] target(s) in 5m 52s368 Running unittests src/main.rs (target/debug/deps/horae-28e72b71798c6b17)369370running 904 tests371test auth::oidc::tests::extra_audiences_are_trusted_only_when_listed ... ok372test auth::oidc::tests::deactivated_email_match_is_denied ... ok373test auth::oidc::tests::first_login_links_subject_via_verified_email ... ok374test auth::oidc::tests::deactivated_subject_match_is_denied ... ok375test auth::oidc::tests::subject_match_logs_in_without_relinking ... ok376test auth::oidc::tests::unverified_email_is_not_matched ... ok377test auth::oidc::tests::no_account_is_denied_not_provisioned ... ok378test auth::oidc::tests::subject_match_takes_precedence_over_email ... ok379test auth::page::tests::dev_variant_offers_the_admin_bypass_and_no_fake_controls ... ok380test auth::page::tests::configured_label_is_html_escaped ... ok381test auth::page::tests::oidc_variant_uses_the_configured_label_and_hands_off_to_start ... ok382test cli::imports::tests::cancellation_racing_completion_does_not_claim_cancellation_was_requested ... ok383test cli::imports::tests::api_submission_captures_generation_without_retrying_uncertain_acceptance ... ok384test cli::imports::tests::invalid_csv_files_fail_before_contacting_the_server ... ok385test cli::imports::tests::csv_named_pipe_is_rejected_without_waiting_for_a_writer ... ok386test cli::imports::tests::malformed_submission_acknowledgement_retains_its_request_identity ... ok387test cli::imports::tests::archived_errors_publish_without_clobbering_and_preserve_the_prior_file_on_failure ... ok388test cli::imports::tests::missing_session_is_a_structured_configuration_failure ... ok389test cli::imports::tests::private_session_accepts_https_and_loopback_only ... ok390test cli::imports::tests::redirects_are_not_followed_or_exposed_as_server_error_text ... ok391test cli::imports::tests::missing_and_mismatched_jobs_fail_without_substitution ... ok392test cli::imports::tests::retry_snapshot_is_compatible_with_missing_and_future_values ... ok393test cli::imports::tests::session_rejects_cookie_header_injection_without_echoing_the_value ... ok394test cli::imports::tests::report_marks_confirmed_failed_outcomes_as_incomplete ... ok395test cli::imports::tests::session_rejects_public_permissions_and_symlinks ... ok396test cli::imports::tests::session_rejects_plaintext_remote_and_credential_bearing_urls ... ok397test cli::imports::tests::ordinary_json_is_bounded_and_invalid_replies_are_not_echoed ... ok398test cli::imports::tests::status_and_wait_distinguish_failed_jobs_from_failed_reads ... ok399test cli::tests::default_command_rejects_invalid_environment_ports ... ok400test cli::tests::environment_probe ... ok401test cli::tests::remote_commands_reject_conflicting_or_unbounded_options ... ok402test cli::tests::remote_import_and_job_commands_accept_the_documented_arguments ... ok403test components::permission_description::tests::permission_descriptions_cover_each_grant_distinctly ... ok404test config::tests::dev_login_is_allowed_on_loopback ... ok405test config::tests::dev_login_is_refused_off_loopback ... ok406test cli::tests::default_command_uses_the_same_defaults_and_environment_as_serve ... ok407test config::tests::environment::environment_probe ... ok408test config::tests::environment::empty_environment_has_no_authentication_or_plugin_credentials ... ok409test config::tests::environment::example_environment_can_configure_all_required_oidc_and_harvest_fields ... ok410test config::tests::environment::job_attempt_limit_uses_the_documented_environment_variable ... ok411test config::tests::environment::invalid_job_attempt_limits_reject_startup ... ok412test config::tests::environment::obsolete_authentication_variables_do_not_configure_the_server ... ok413test config::tests::environment::mail_environment_requires_a_complete_valid_configuration ... ok414test config::tests::environment::partial_oidc_configuration_remains_disabled_without_a_callback ... ok415test config::tests::without_dev_login_any_bind_is_fine ... ok416test db::tests::pool_connections_force_custom_plans ... ok417test config::tests::environment::secure_cookies_use_the_documented_prefixed_variable ... ok418test auth::oidc::tests::linking::existing_subject_wins_over_another_accounts_email ... ok419test auth::oidc::tests::linking::deactivation_during_first_link_denies_login ... ok420test auth::oidc::tests::linking::simultaneous_logins_with_the_same_subject_are_allowed ... ok421test auth::oidc::tests::linking::unverified_email_cannot_link_an_account ... ok422test auth::oidc::tests::linking::different_subjects_cannot_both_claim_an_unlinked_account ... ok423test harvest::pagination_tests::harvest_own_time_omits_private_project_budget_metadata ... ok424test cli::imports::tests::wait_deadline_caps_a_pending_request_without_cancelling_the_job ... ok425test harvest::pagination_tests::harvest_pagination_total_pages_does_not_overflow ... ok426test db::tests::reset_empties_the_database_and_reapplies_migrations ... ok427test harvest::pagination_tests::harvest_pagination_time_entries_keep_the_filtered_set_and_date_ties ... ok428test harvest::pagination_tests::harvest_pagination_empty_and_out_of_range_pages_keep_the_contract ... ok429test harvest::tests::a_manager_lists_users_with_their_rates ... ok430test harvest::pagination_tests::harvest_task_access_filters_counts_and_preserves_rate_free_history ... ok431test harvest::tests::a_manager_sees_the_whole_org ... ok432test harvest::tests::a_member_cannot_fetch_a_colleagues_entry ... ok433test harvest::pagination_tests::harvest_project_progress_permissions_cover_counts_pages_and_details ... ok434test harvest::tests::a_member_cannot_filter_to_a_colleague ... ok435test harvest::tests::a_member_cannot_list_users ... ok436test harvest::pagination_tests::harvest_pagination_malformed_filters_are_client_errors ... ok437test harvest::tests::a_member_sees_only_their_own_time_entries ... ok438test harvest::tests::harvest_effective_minutes_match_sql_for_open_and_frozen_time ... ok439test harvest::tests::harvest_entry_rates_follow_the_cascade_and_frozen_invoice_line ... ok440test harvest::tests::harvest_marks_unbilled_non_billable_contexts_consistently ... ok441test harvest::tests::page_window_defaults_and_checked_offsets ... ok442test harvest::pagination_tests::harvest_pagination_router_preserves_session_and_tenant_guards ... ok443test harvest::tests::harvest_entry_rates_respect_selected_project_mode ... ok444test importers::harvest::account_switch::tests::change_preserves_terminal_history_and_rejects_stale_confirmation ... ok445test importers::harvest::account_switch::tests::a_b_a_keeps_old_callbacks_requests_and_retries_fenced ... ok446test harvest::tests::members_cannot_read_own_project_rates_or_cost_overrides ... ok447test harvest::tests::imported_legacy_rates_survive_retry_in_harvest_list_and_detail ... ok448test importers::harvest::account_switch::tests::competing_callbacks_and_confirmations_have_one_winner ... ok449test importers::harvest::account_switch::tests::queued_work_and_provenance_block_without_changing_binding ... ok450test importers::harvest::account_switch::tests::queue_acceptance_does_not_wait_for_the_import_session_lock ... ok451test importers::harvest::account_switch::tests::disconnect_and_reconnect_fence_callbacks_but_not_same_account_work ... ok452test importers::harvest::api_source::http::tests::cancelled_backoff_does_not_wait_or_retry ... ok453test importers::harvest::api_source::http::tests::cursor_links_are_authoritative_even_with_null_or_stale_page_numbers ... ok454test importers::harvest::account_switch::tests::competing_change_and_submission_cannot_both_succeed ... ok455test importers::harvest::api_source::http::tests::http_pages_follow_cursor_and_preserve_headers_and_encoded_filter ... ok456test harvest::pagination_tests::harvest_pagination_catalog_links_preserve_filters_and_break_name_ties ... ok457test importers::harvest::api_source::http::tests::missing_next_cursor_is_not_silently_treated_as_completed ... ok458test importers::harvest::api_source::http::tests::pagination_cycle_detection_survives_restarting_after_every_page ... ok459test importers::harvest::api_source::http::tests::persisted_cursor_resumes_with_a_new_client_and_stays_complete_at_eof ... ok460test importers::harvest::api_source::http::tests::rejected_page_does_not_advance_the_cursor ... ok461test importers::harvest::api_source::http::tests::rejects_pagination_outside_the_authenticated_endpoint ... ok462test importers::harvest::api_source::http::tests::resumed_cursor_rejects_untrusted_destinations_and_invalid_state_before_http ... ok463test importers::harvest::api_source::http::tests::http_retries_429_but_never_follows_redirects_or_shortens_long_backoff ... ok464test importers::harvest::api_source::tests::assembled_rows_convert_to_exact_minutes ... ok465test importers::harvest::api_source::tests::assembles_rows_joining_parents_by_id ... ok466test importers::harvest::api_source::tests::hours_render_as_exact_decimals ... ok467test importers::harvest::api_source::tests::http_page_preserves_decimal_values_before_integer_conversion ... ok468test importers::harvest::api_source::tests::json_exponents_expand_exactly_with_bounded_output ... ok469test importers::harvest::account_switch::tests::retry_and_change_are_serialized ... ok470test importers::harvest::credentials::tests::bad_key_length_is_rejected ... ok471test importers::harvest::api_source::http::tests::http_rejects_oversized_malformed_and_cyclic_pages ... ok472test importers::harvest::account_switch::tests::successful_change_preserves_business_rows_and_failure_rolls_back_secrets ... ok473test importers::harvest::account_switch::tests::running_jobs_block_change_and_old_execution_never_reaches_http ... ok474test importers::harvest::api_source::http::tests::slow_consumer_backpressures_http_and_cancellation_stops_further_pages ... ok475test importers::harvest::credentials::tests::decode_hex_rejects_bad_input ... ok476test importers::harvest::credentials::tests::concurrent_first_connections_cannot_bind_different_accounts ... ok477test importers::harvest::credentials::tests::encrypt_then_decrypt_round_trips ... ok478test harvest::pagination_tests::harvest_project_cost_overrides_require_admin_without_fabricated_fallback ... ok479test importers::harvest::credentials::tests::another_account_cannot_replace_credentials_or_watermarks ... ok480test importers::harvest::credentials::tests::nonce_makes_ciphertext_nondeterministic ... ok481test importers::harvest::credentials::tests::connection_changes_work_with_a_single_connection_pool ... ok482test importers::harvest::credentials::tests::disconnect_preserves_identity_and_provenance_for_the_original_account ... ok483test importers::harvest::credentials::tests::wrong_key_fails_to_decrypt ... ok484test importers::harvest::credentials::tests::connect_and_disconnect_share_import_exclusion_without_blocking_other_orgs ... ok485test importers::harvest::csv_source::tests::conflicting_email_aliases_error_only_the_affected_row ... ok486test importers::harvest::csv_source::tests::bad_date_becomes_a_row_error_not_a_rejection ... ok487test importers::harvest::csv_source::tests::cursor_beyond_upload_is_rejected_without_parsing_rows ... ok488test importers::harvest::csv_source::tests::cursor_resumes_after_multiline_unicode_and_preserves_error_locations ... ok489test importers::harvest::csv_source::tests::csv_records_preserve_multiline_unicode_across_single_byte_reads ... ok490test importers::harvest::csv_source::tests::empty_file_is_rejected ... ok491test importers::harvest::csv_source::tests::delivers_a_row_before_reading_the_rest_of_the_file ... ok492test importers::harvest::csv_source::tests::invalid_utf8_errors_one_record_and_continues ... ok493test importers::harvest::csv_source::tests::identity_columns_are_required_and_cannot_repeat ... ok494test importers::harvest::csv_source::tests::missing_required_columns_is_rejected ... ok495test importers::harvest::csv_source::tests::names_stay_separate_from_optional_email ... ok496test importers::harvest::csv_source::tests::parse_bool_accepts_yes_variants ... ok497test importers::harvest::csv_source::tests::parses_rows_case_insensitively ... ok498test importers::harvest::credentials::tests::failed_credential_write_does_not_leave_an_account_binding ... ok499test importers::harvest::credentials::tests::same_account_reconnect_rotates_encryption_without_resetting_watermarks ... ok500test harvest::pagination_tests::harvest_pagination_rejects_invalid_windows_on_every_collection ... ok501test importers::harvest::credentials::tests::migration_binds_existing_connections_without_changing_secrets_or_markers ... ok502test importers::harvest::engine_tests::api_and_csv_share_the_lock_but_other_organizations_can_import ... ok503test importers::harvest::engine_tests::api_connection_checks_work_with_a_single_connection_pool ... ok504test importers::harvest::credentials::tests::unidentified_legacy_provenance_requires_operator_review ... ok505test importers::harvest::engine_tests::bad_records_are_reported_and_run_continues ... ok506test importers::harvest::engine_tests::api_sync_adopts_entries_from_a_prior_csv_import ... ok507test importers::harvest::engine_tests::cancelled_http_waiter_keeps_the_lock_until_its_worker_exits ... ok508test importers::harvest::engine_tests::cancellation_rolls_back_rows_and_releases_the_import_session ... ok509test importers::harvest::engine_tests::concurrent_imports_reject_overlap_without_collapsing_repeated_entries ... ok510test importers::harvest::engine_tests::csv_ambiguous_names_include_inactive_users_but_unique_email_disambiguates ... ok511test importers::harvest::engine_tests::csv_malformed_file_is_rejected_with_no_writes ... ok512test importers::harvest::engine_tests::csv_import_populates_and_is_idempotent ... ok513test importers::harvest::engine_tests::csv_name_fallback_requires_a_full_unique_name_and_never_overrides_email ... ok514test importers::harvest::engine_tests::csv_name_only_dry_run_and_duplicate_occurrences_preserve_history ... ok515test importers::harvest::engine_tests::csv_name_only_matches_one_org_user_and_reimports_without_duplicates ... ok516test importers::harvest::credentials::tests::completed_credential_changes_allow_immediate_retries ... ok517test importers::harvest::engine_tests::csv_streaming::cancelling_a_csv_waiting_for_more_bytes_releases_its_session ... ok518test importers::harvest::engine_tests::csv_streaming::csv_applies_before_eof_but_transport_failure_rolls_back_everything ... ok519test importers::harvest::engine_tests::csv_streaming::csv_preview_errors_and_repeated_rows_match_commit_and_reimport ... ok520test importers::harvest::engine_tests::completed_imports_allow_immediate_retries ... ok521test importers::harvest::engine_tests::csv_streaming::csv_sql_backpressure_stops_reading_later_input_rows ... ok522test importers::harvest::engine_tests::csv_streaming::durable_csv_cancel_joins_parser_and_preserves_committed_rows ... ok523test importers::harvest::engine_tests::csv_streaming::durable_csv_preview_crosses_batch_boundaries_without_committing_domain_data ... ok524test importers::harvest::engine_tests::csv_streaming::durable_csv_report_metadata_is_bounded_after_recovery ... ok525test importers::harvest::engine_tests::csv_streaming::durable_csv_preview_cancel_preserves_simulation_for_manual_retry ... ok526test importers::harvest::engine_tests::csv_streaming::durable_csv_cancel_preserves_its_completed_batches_for_manual_retry ... ok527test importers::harvest::engine_tests::csv_streaming::measure_csv_durable_100k ... ignored, 100,000-row durable CSV measurement; run explicitly with --release --nocapture528test importers::harvest::engine_tests::csv_streaming::measure_csv_durable_large_catalog_100k ... ignored, 100,000-row durable CSV with 5,000 parent sets; run explicitly with --release --nocapture529test importers::harvest::engine_tests::csv_streaming::measure_csv_streaming_100k ... ignored, 100,000-row CSV measurement; run explicitly with --release --nocapture530test importers::harvest::engine_tests::csv_streaming::measure_csv_streaming_large_catalog_100k ... ignored, 100,000-row CSV with 5,000 parent sets; run explicitly with --release --nocapture531test importers::harvest::engine_tests::csv_streaming::durable_csv_preview_resumes_after_a_crash_without_recounting_rows ... ok532test importers::harvest::engine_tests::distinct_harvest_ids_with_identical_fields_import_as_two ... ok533test importers::harvest::engine_tests::csv_streaming::durable_csv_stale_commit_is_fenced_without_a_heartbeat ... ok534test importers::harvest::engine_tests::dry_run_writes_nothing_and_matches_commit ... ok535test importers::harvest::engine_tests::csv_streaming::durable_csv_preview_rejects_a_stale_next_batch ... ok536test importers::harvest::engine_tests::edited_entry_still_matched_by_provenance ... ok537test importers::harvest::engine_tests::failed_source_releases_the_session_and_rolls_back_partial_rows ... ok538test importers::harvest::engine_tests::import_rejects_ambiguous_normalized_email_without_partial_writes ... ok539test importers::harvest::engine_tests::full_import_creates_all_levels_with_exact_minutes ... ok540test importers::harvest::engine_tests::lookup_cache::cold_query_callsite_on_untraced_thread_is_still_captured ... ok541test importers::harvest::engine_tests::lookup_cache::cached_email_and_full_name_do_not_share_a_namespace ... ok542test importers::harvest::engine_tests::lookup_cache::cached_project_task_still_validates_each_rows_rate ... ok543test importers::harvest::engine_tests::lookup_cache::lookup_index_migration_preserves_existing_ambiguous_identities ... ok544test importers::harvest::engine_tests::lookup_cache::new_run_rechecks_previously_cached_user_for_ambiguity ... ok545test importers::harvest::engine_tests::lookup_cache::project_task_cache_distinguishes_both_sides_of_the_link ... ok546test importers::harvest::engine_tests::csv_streaming::durable_csv_resumes_committed_batches_without_recounting_duplicate_rows ... ok547test importers::harvest::engine_tests::lookup_cache::rolled_back_row_does_not_cache_user_or_project_task ... ok548test importers::harvest::engine_tests::csv_streaming::durable_csv_reclaimed_lease_cannot_commit_the_next_batch ... ok549test importers::harvest::engine_tests::natural_key_reimport_normalizes_whitespace_and_ascii_case ... ok550test importers::harvest::engine_tests::overflowing_decimals_fail_only_their_rows ... ok551test importers::harvest::engine_tests::reimporting_identical_csv_rows_is_idempotent ... ok552test importers::harvest::engine_tests::second_identical_run_creates_nothing ... ok553test importers::harvest::oauth::tests::authorize_url_carries_state_and_encoded_redirect ... ok554test importers::harvest::oauth::tests::authorize_url_preserves_query_values_without_injecting_parameters ... ok555test importers::harvest::oauth_callback_tests::account_policy_failures_return_safe_actionable_conflicts ... ok556test importers::harvest::oauth_callback_tests::mismatched_state_is_rejected_without_a_code ... ok557test importers::harvest::oauth_callback_tests::missing_returned_state_is_rejected ... ok558test importers::harvest::oauth_callback_tests::missing_stored_state_is_rejected ... ok559test importers::harvest::oauth_callback_tests::provider_error_is_rejected_before_exchange ... ok560test importers::harvest::oauth_callback_tests::valid_matching_state_yields_the_code ... ok561test importers::harvest::oauth_callback_tests::valid_state_but_missing_code_is_rejected ... ok562test importers::harvest::report::tests::archive_metadata_cannot_masquerade_as_a_legacy_or_inconsistent_report ... ok563test importers::harvest::report::tests::archived_report_round_trips_without_losing_error_accounting ... ok564test importers::harvest::report::tests::legacy_report_preserves_its_counts_and_error_details ... ok565test importers::harvest::report::tests::report_rejects_unsupported_and_invalid_versions ... ok566test importers::harvest::report::tests::serialized_report_has_a_supported_schema_version ... ok567test importers::harvest::resolve::checkpoint_tests::run_cache_round_trip_preserves_identity_namespaces_and_occurrences ... ok568test importers::harvest::engine_tests::submission_barrier_blocks_imported_time_entries ... ok569test importers::harvest::engine_tests::two_identical_csv_rows_import_as_two_entries ... ok570test importers::harvest::engine_tests::watermark_advances_only_on_commit ... ok571test importers::harvest::resolve::preview::tests::rejects_foreign_parent_snapshots_before_restoring_any_rows ... ok572test importers::harvest::resolve::preview::tests::checkpoint_restores_known_task_currency_and_keeps_old_currency_unknown ... ok573test importers::harvest::streaming::durable::preview::tests::restoration_omits_unneeded_virtual_entries ... ok574test importers::harvest::streaming::tests::api_planning_policy_ends_with_the_transaction ... ok575test importers::harvest::engine_tests::lookup_cache::repeated_rows_resolve_each_user_and_project_task_once ... ok576test importers::harvest::sync_tests::api_rejects_ambiguous_email_without_advancing_watermark ... ok577test importers::harvest::sync_tests::api_requires_email_even_when_full_name_matches ... ok578test importers::harvest::sync_tests::checkpoints::durable_api_cancellation_preserves_confirmed_pages_for_manual_retry ... ok579test importers::harvest::sync_tests::checkpoints::durable_api_finalization_retry_does_not_repeat_completed_downloads ... ok580test importers::harvest::sync_tests::checkpoints::durable_api_preview_cancellation_preserves_confirmed_pages_for_manual_retry ... ok581test importers::harvest::sync_tests::checkpoints::durable_api_preview_finalization_retry_does_not_repeat_completed_downloads ... ok582test importers::harvest::sync_tests::checkpoints::durable_api_preview_reclaimed_worker_cannot_checkpoint_its_next_page ... ok583test importers::harvest::sync_tests::checkpoints::durable_api_preview_resume_preserves_row_errors ... ok584test importers::harvest::engine_tests::large_run_reuses_parents_and_reconciles_totals ... ok585test importers::harvest::sync_tests::checkpoints::durable_api_preview_resumes_catalog_download ... ok586test importers::harvest::sync_tests::checkpoints::durable_api_preview_preserves_adoptions_and_repeated_ids_across_recovery ... ok587test importers::harvest::sync_tests::checkpoints::durable_api_reclaimed_worker_cannot_commit_its_next_page ... ok588test importers::harvest::sync_tests::checkpoints::durable_api_preview_resumes_pages_without_publishing_domain_data ... ok589test importers::harvest::sync_tests::checkpoints::durable_api_resume_keeps_earlier_errors_and_does_not_advance_watermark ... ok590test importers::harvest::engine_tests::csv_streaming::csv_measurement_recovers_a_complete_batch_without_recounting ... ok591test importers::harvest::sync_tests::checkpoints::durable_api_resume_remembers_an_earlier_missing_timestamp ... ok592test importers::harvest::sync_tests::checkpoints::durable_api_preview_resumes_after_a_confirmed_parent_batch ... ok593test importers::harvest::sync_tests::disconnect_and_reconnect_preserves_imported_records_and_exact_identity ... ok594test importers::harvest::sync_tests::checkpoints::durable_api_resumes_a_partially_downloaded_catalog ... ok595test importers::harvest::sync_tests::checkpoints::failed_api_commit_publishes_its_last_confirmed_page_report ... ok596test importers::harvest::sync_tests::checkpoints::durable_api_resumes_committed_pages_and_preserves_the_high_watermark ... ok597test importers::harvest::sync_tests::dry_run_leaves_data_provenance_and_watermark_unchanged ... ok598test importers::harvest::sync_tests::checkpoints::failed_api_preview_publishes_its_last_confirmed_page_report ... ok599test importers::harvest::sync_tests::empty_sync_does_not_invent_a_watermark ... ok600test importers::harvest::sync_tests::exact_api_decimals_survive_preview_commit_and_reimport ... ok601test importers::harvest::sync_tests::failed_client_propagates_to_project_and_entry_without_placeholder_records ... ok602test importers::harvest::sync_tests::invalid_parent_blocks_dependent_time_but_other_catalog_records_survive ... ok603test importers::harvest::sync_tests::failed_rows_are_available_to_the_next_incremental_retry ... ok604test importers::harvest::sync_tests::missing_client_fallback_and_failed_project_savepoints_do_not_poison_cache ... ok605test importers::harvest::sync_tests::missing_source_timestamp_keeps_the_previous_watermark ... ok606test importers::harvest::sync_tests::out_of_range_api_decimals_error_per_row_and_leave_retry_watermark ... ok607test importers::harvest::sync_tests::paging::cancelled_page_consumer_retains_lock_until_worker_exits_and_rolls_back ... ok608test importers::harvest::sync_tests::paging::durable_api_stale_commit_cannot_advance_data_or_watermark ... ok609test importers::harvest::sync_tests::parent_catalog_preserves_metadata_and_counts_each_entity_once ... ok610test importers::harvest::sync_tests::paging::later_download_failure_rolls_back_parents_rows_and_watermark ... ok611test importers::harvest::sync_tests::scale::api_100k_commit_and_reimport ... ignored, 100,000-entry scale measurement; run explicitly with --release --nocapture612test importers::harvest::sync_tests::scale::api_100k_dry_run ... ignored, 100,000-entry scale measurement; run explicitly with --release --nocapture613test importers::harvest::sync_tests::scale::api_durable_100k_commit_and_reimport ... ignored, 100,000-entry durable API measurement; run explicitly with --release --nocapture614test importers::harvest::sync_tests::scale::api_durable_100k_dry_run ... ignored, 100,000-entry durable API measurement; run explicitly with --release --nocapture615test importers::harvest::sync_tests::parent_only_api_import_creates_catalog_and_reimport_skips_it ... ok616test importers::harvest::sync_tests::checkpoints::durable_api_resumes_after_a_confirmed_parent_batch ... ok617test importers::harvest::sync_tests::parent_only_dry_run_previews_without_persisting_catalog ... ok618test importers::harvest::sync_tests::refreshed_tokens_survive_a_dry_run_rollback_in_the_same_import_session ... ok619test importers::harvest::engine_tests::csv_streaming::durable_csv_preview_matches_existing_and_new_rows_with_one_connection ... ok620test importers::harvest::sync_tests::successful_sync_only_marks_the_incrementally_fetched_entity ... ok621test importers::harvest::sync_tests::paging::durable_api_cancel_waits_for_the_producer_before_acknowledging ... ok622test importers::harvest::sync_tests::watermark_write_failure_rolls_back_imported_data ... ok623test importers::harvest::sync_tests::watermark_never_passes_the_start_of_capture ... ok624test init::tests::init_refuses_when_an_organization_exists ... ok625test init::tests::init_creates_one_org_and_one_admin_and_nothing_else ... ok626test jobs::outbox::tests::acknowledges_confirmed_delivery_without_reclaiming_it ... ok627test importers::harvest::sync_tests::paging::invalid_and_missing_timestamp_rows_cross_page_boundaries_without_advancing ... ok628test jobs::report::stream_tests::download_keeps_its_snapshot_when_later_progress_archives_the_inline_tail ... ok629test jobs::outbox::tests::invalid_payload_is_not_delivered_and_does_not_leak_into_errors ... ok630test importers::harvest::sync_tests::scale::http_pages_preview_commit_and_reimport ... ok631test importers::harvest::sync_tests::scale::durable_measurement_finishes_from_its_eof_checkpoint ... ok632test jobs::report::stream_tests::download_reads_only_when_consumed_and_releases_its_connection ... ok633test jobs::tests::api_job_keeps_its_policy_across_duplicate_enqueue_and_manual_retry ... ok634test jobs::tests::cancellation_and_retry_are_scoped_and_idempotent ... ok635test jobs::outbox::tests::worker_delivers_available_events_and_stops_cleanly ... ok636test jobs::outbox::tests::plugin_failure_retries_with_the_same_event_identity ... ok637test jobs::tests::claims_are_atomic_and_expired_leases_recover ... ok638test jobs::report::tests::legacy_upgrade_preserves_job_states_and_existing_archives ... ok639test jobs::tests::cancellation_waits_for_the_claimed_execution_before_allowing_retry ... ok640test jobs::report::tests::report_fragments_survive_until_the_owning_job_expires ... ok641test jobs::report::tests::upgrading_legacy_reports_preserves_errors_and_fences_old_attempts ... ok642test jobs::tests::cancellation_survives_a_crash_before_the_worker_acknowledges ... ok643test jobs::tests::expired_final_attempt_fails_without_claiming_again ... ok644test jobs::report::stream_tests::download_reports_missing_fragments_after_its_buffered_page ... ok645test importers::harvest::sync_tests::scale::durable_api_report_preserves_overflow_errors_after_recovery ... ok646test jobs::tests::failed_csv_preview_retains_confirmed_report_through_history_and_retry ... ok647test jobs::tests::history_paginates_tied_timestamps_and_rejects_foreign_cursors ... ok648test jobs::tests::csv_job_persists_its_policy_with_the_upload ... ok649test jobs::tests::cleanup_retains_retryable_uploads_and_deletes_expired_jobs ... ok650test jobs::tests::final_failure_is_retained_and_manual_retry_gets_a_new_budget ... ok651test jobs::tests::expired_lease_cannot_renew_or_commit_using_an_old_transaction_timestamp ... ok652test jobs::tests::concurrent_csv_resubmission_preserves_identity_after_upload_cleanup ... ok653test jobs::tests::import_adapters_reject_a_lease_from_another_organization ... ok654test jobs::tests::outbox_delivery_is_idempotent ... ok655test jobs::tests::invalid_policy_cannot_enqueue_a_job_or_upload ... ok656test jobs::tests::failed_csv_commit_retains_confirmed_report_through_history_and_retry ... ok657test jobs::tests::payload_kind_is_stable_and_round_trips ... ok658test jobs::tests::payload_versions_preserve_legacy_jobs_and_reject_unknown_versions ... ok659test jobs::tests::outbox_stale_claims_cannot_acknowledge_or_reschedule_delivery ... ok660test jobs::tests::retry_snapshot_does_not_guess_unknown_payloads_or_sources ... ok661test jobs::tests::missing_configuration_records_error_and_requeues ... ok662test jobs::tests::shutdown_deadline_drops_and_joins_in_flight_work ... ok663test jobs::tests::shutdown_waits_for_in_flight_work ... ok664test jobs::tests::retry_snapshot_matches_status_and_list_without_exposing_payload ... ok665test jobs::tests::missing_csv_upload_records_error_and_requeues ... ok666test jobs::tests::invalid_stored_payloads_reach_a_terminal_error ... ok667test jobs::tests::stopped_worker_leaves_queued_jobs_unclaimed ... ok668test jobs::tests::synthetic_job_uses_the_same_registered_envelope ... ok669test jobs::tests::submission_key_cannot_change_api_mode_or_scope ... ok670test models::project_creation::tests::draft_roundtrip_preserves_incomplete_input_without_demo_data ... ok671test models::project_creation::tests::unauthorized_catalog_cost_is_absent_from_serialized_options ... ok672test models::project_creation::tests::unknown_draft_fields_are_rejected ... ok673test jobs::tests::upload_organization_must_match_its_job ... ok674test notifications::tests::cancelling_delivery_kills_the_active_sender ... ok675test jobs::tests::outbox_rollback_does_not_publish_an_event ... ok676test notifications::tests::acknowledged_email_is_never_claimed_again ... ok677test notifications::tests::disabled_mail_worker_does_not_claim_pending_notifications ... ok678test notifications::tests::mail_configuration_is_disabled_by_default_and_rejects_partial_values ... ok679test notifications::tests::mail_configuration_requires_an_executable_file_and_safe_sender ... ok680test jobs::tests::outbox_claims_only_the_requested_event_kind ... ok681test notifications::tests::recipient_injection_is_rejected_before_starting_a_process ... ok682test notifications::tests::rendered_mail_bounds_body_lines_for_long_unicode_and_control_names ... ok683test notifications::tests::failed_email_retries_same_identity_and_eventually_stops ... ok684test notifications::tests::foreign_notification_payload_is_terminal_and_never_sent ... ok685test notifications::tests::sendmail_failure_does_not_expose_program_output ... ok686test notifications::tests::mail_worker_delivers_only_its_kind_and_drains_cleanly ... ok687test notifications::tests::sendmail_receives_fixed_arguments_and_stable_message_identity ... ok688test jobs::tests::outbox_same_kind_consumers_cannot_claim_the_same_lease ... ok689test notifications::tests::retry_can_recover_without_changing_message_identity ... ok690test pages::clients::filters::tests::clearing_query_preserves_selected_currency_and_lifecycle ... ok691test pages::clients::filters::tests::lifecycle_counts_share_query_and_currency_filters ... ok692test pages::clients::filters::tests::name_search_ignores_case_and_surrounding_whitespace ... ok693test pages::clients::filters::tests::preferred_or_visible_project_currency_matches_but_query_still_applies ... ok694test pages::clients::form::tests::absent_billing_authority_never_produces_an_edit_payload ... ok695test pages::clients::form::tests::ambiguous_creation_errors_require_explicit_recovery ... ok696test pages::clients::form::tests::clearing_a_rate_is_explicit_and_needs_no_currency_confirmation ... ok697test pages::clients::form::tests::invalid_fields_are_not_rewritten_by_validation ... ok698test pages::clients::form::tests::rate_replacement_requires_confirmation_in_the_current_currency ... ok699test pages::clients::form::tests::untouched_fields_keep_zero_rate_and_original_snapshot ... ok700test pages::importers::presentation::tests::interrupted_report_is_partial_regardless_of_retry_prerequisites ... ok701test pages::importers::presentation::tests::no_selection_does_not_claim_no_import_history ... ok702test pages::importers::presentation::tests::source_labels_do_not_guess_unknown_importers ... ok703test pages::importers::presentation::tests::states_and_phases_have_readable_unknown_fallbacks ... ok704test pages::importers::presentation::tests::summaries_distinguish_zero_skipped_and_mixed_outcomes ... ok705test pages::invoices::defaults_form::tests::invoice_fields_bound_metadata_by_characters_and_reject_nul ... ok706test pages::invoices::defaults_form::tests::invoice_fields_preserve_exact_percentages_and_custom_terms ... ok707test pages::invoices::defaults_form::tests::invoice_fields_preserve_receipt_terms_and_empty_optional_percentages ... ok708test pages::invoices::defaults_form::tests::invoice_fields_reject_invalid_percentages_terms_and_second_tax ... ok709test pages::invoices::preparation::fees::tests::fee_inputs_require_exact_amounts_and_an_explicit_positive_charge ... ok710test pages::invoices::preparation::fees::tests::refresh_keeps_raw_edits_and_does_not_select_new_sources ... ok711test pages::invoices::preparation::fees::tests::refresh_preserves_missing_or_relabelled_edits_until_explicit_removal ... ok712test pages::invoices::preparation::tests::invoice_context_selects_only_the_exact_available_client ... ok713test pages::invoices::preparation::tests::invoice_review_requires_matching_sources_and_valid_values ... ok714test pages::invoices::preparation::tests::unavailable_or_malformed_invoice_context_never_uses_the_first_client ... ok715test pages::new_project::basics::tests::a_batch_that_would_exceed_the_tag_limit_is_rejected ... ok716test pages::new_project::basics::tests::a_full_tag_list_still_accepts_a_duplicate ... ok717test pages::new_project::basics::tests::overlong_tags_are_rejected_without_truncation ... ok718test pages::new_project::basics::tests::tag_length_counts_characters_instead_of_bytes ... ok719test pages::new_project::basics::tests::tags_trim_and_deduplicate_without_changing_existing_spelling ... ok720test pages::new_project::billing::tests::budget_errors_target_a_control_that_can_be_corrected ... ok721test pages::new_project::draft::tests::a_mismatched_acknowledgement_does_not_lose_pending_input ... ok722test pages::new_project::draft::tests::a_retry_keeps_the_unacknowledged_payload_and_revision ... ok723test pages::new_project::draft::tests::a_validation_rejection_allows_corrected_input_at_the_same_revision ... ok724test pages::new_project::draft::tests::an_empty_form_is_not_reported_as_saved ... ok725test pages::new_project::draft::tests::any_saved_draft_wins_over_context_including_empty_or_matching_client ... ok726test pages::new_project::draft::tests::context_prefills_only_a_new_form_without_fixing_its_currency ... ok727test pages::new_project::draft::tests::resuming_preserves_the_server_identity_and_incomplete_fields ... ok728test pages::new_project::team::tests::adding_everyone_deduplicates_without_replacing_project_overrides ... ok729test pages::new_project::team::tests::exceeding_the_team_limit_does_not_partially_add_people ... ok730test pages::new_project::team::tests::removing_a_member_keeps_an_empty_restricted_task_restricted ... ok731test pages::new_project::tests::a_rejected_creation_can_be_edited_but_an_uncertain_commit_must_be_retried ... ok732test pages::new_project::tests::only_known_validation_fields_can_target_a_control ... ok733test pages::projects::budget_display_tests::configured_scopes_sum_without_hiding_an_individual_overrun ... ok734test pages::projects::budget_display_tests::display_preserves_units_sign_and_large_integer_values ... ok735test pages::projects::budget_display_tests::tag_filter_matches_identity_without_duplicates_or_name_collisions ... ok736test pages::projects::budget_display_tests::unallocated_zero_and_overflow_budgets_are_not_conflated ... ok737test pages::reports::tests::cost_total_uses_organization_currency_across_billing_currencies ... ok738test pages::reports::tests::mixed_currencies_are_not_added_even_when_the_numbers_would_overflow ... ok739test pages::reports::tests::monetary_total_overflow_is_visible_instead_of_panicking ... ok740test notifications::tests::revoked_recipient_does_not_receive_a_pending_email ... ok741test pages::reports::tests::redacted_costs_do_not_become_zero_or_partial_totals ... ok742test pages::reports::tests::single_currency_totals_are_formatted_and_empty_reports_have_no_amount ... ok743test pages::settings::own_permissions::tests::own_permissions_view_admin_identity_is_explicit_not_derived_from_grants ... ok744test pages::settings::own_permissions::tests::own_permissions_view_distinguishes_authentication_forbidden_and_failure ... ok745test pages::settings::own_permissions::tests::own_permissions_view_does_not_disclose_internal_fields_or_offer_edits ... ok746test pages::settings::own_permissions::tests::own_permissions_view_grants_do_not_promise_unavailable_features ... ok747test pages::settings::own_permissions::tests::own_permissions_view_empty_grants_are_not_normalized ... ok748test pages::settings::own_permissions::tests::own_permissions_view_legacy_is_not_empty_or_a_profile ... ok749test pages::settings::own_permissions::tests::own_permissions_view_loading_hides_previous_snapshot ... ok750test pages::settings::own_permissions::tests::own_permissions_view_preserves_exact_grants_without_profile_inference ... ok751test pages::settings::own_permissions::tests::own_permissions_view_unsupported_catalog_hides_uninterpretable_grants ... ok752test pages::timesheet::tests::cal_span_day_shows_only_the_anchor_column ... ok753test pages::timesheet::tests::cal_span_defaults_to_week ... ok754test pages::timesheet::tests::cal_span_unknown_falls_back_to_week ... ok755test pages::timesheet::tests::cal_span_week_shows_all_seven_days ... ok756test pages::timesheet::tests::cal_span_url_roundtrips ... ok757test pages::timesheet::tests::cal_span_work_week_preserves_date_order_across_weekends ... ok758test pages::timesheet::tests::cal_span_work_week_shows_monday_to_friday ... ok759test pages::timesheet::tests::day_col_class_marks_today ... ok760test pages::timesheet::tests::day_col_class_marks_weekend ... ok761test pages::timesheet::tests::day_col_class_plain_weekday ... ok762test pages::timesheet::tests::cal_span_work_week_skips_sunday_when_it_is_the_first_column ... ok763test pages::timesheet::tests::day_col_class_today_wins_over_weekend ... ok764test pages::timesheet::tests::invalid_duration_cannot_start_a_timer_save_or_clear_a_cell ... ok765test pages::timesheet::tests::timed_lanes_still_widens_overlapping_entries ... ok766test pages::timesheet::tests::only_a_blank_duration_can_start_an_eligible_timer ... ok767test pages::timesheet::tests::timed_lanes_terminates_on_a_zero_length_entry ... ok768test pages::timesheet::tests::today_offset_is_none_after_the_week ... ok769test pages::timesheet::tests::today_offset_is_none_before_the_week ... ok770test pages::timesheet::tests::today_offset_is_six_on_the_sunday ... ok771test pages::timesheet::tests::value_cell_class_empty_wins_over_today ... ok772test pages::timesheet::tests::value_cell_class_marks_today_when_nonzero ... ok773test pages::timesheet::tests::today_offset_is_zero_on_the_monday ... ok774test pages::timesheet::tests::weekend_style_follows_the_date_not_the_column_offset ... ok775test pages::timesheet::tests::weekly_duration_edit_preserves_nine_am_start_notes_and_billability ... ok776test pages::timesheet::tests::weekly_new_entries_are_untimed_and_explicit_clears_still_work ... ok777test notifications::tests::verbose_sender_output_is_discarded_without_blocking_delivery ... ok778test notifications::tests::stale_email_lease_cannot_start_delivery ... ok779test jobs::tests::reclaimed_attempt_rejects_stale_results_even_with_the_same_worker_name ... ok780test notifications::tests::sendmail_timeout_kills_and_reaps_the_child ... ok781test plugin::database::tests::application_database_owner_is_not_a_plugin_identity ... ok782test plugin::database::tests::dedicated_reader_is_accepted_but_new_write_grants_are_rejected ... ok783test plugin::database::tests::project_configuration_is_private_even_when_plugin_grants_are_misconfigured ... ok784test plugin::event::tests::active_transition_fires_only_on_a_real_flip ... ok785test plugin::event::tests::budget_and_timer_events_serialize ... ok786test jobs::tests::submission_key_cannot_change_csv_bytes_or_mode ... ok787test plugin::event::tests::project_membership_payload_excludes_private_configuration ... ok788test plugin::event::tests::role_change_event_carries_previous_role ... ok789test plugin::event::tests::submission_event_serializes_payload ... ok790test plugin::event::tests::new_events_have_stable_hook_names ... ok791test plugin::event::tests::us2_events_have_stable_hook_names ... ok792test plugin::host::tests::config_lookup::a_set_key_is_returned ... ok793test plugin::host::tests::config_lookup::an_unset_key_is_none ... ok794test plugin::database::tests::reader_accepts_optional_first_party_rounding_helper ... ok795test plugin::database::tests::reader_cannot_execute_security_definer_functions ... ok796test plugin::database::tests::reader_cannot_have_access_to_credentials ... ok797test plugin::database::tests::reader_cannot_switch_into_another_role ... ok798test plugin::host::tests::database_tests::unconfigured_sql_never_falls_back_to_application_state ... ok799test plugin::database::tests::reader_rejects_unapproved_invoker_functions ... ok800test plugin::host::tests::response_shaping::error_json_wraps_the_message ... ok801test plugin::host::tests::response_shaping::http_body_accepts_the_size_limit_and_rejects_larger_responses ... ok802test plugin::host::tests::response_shaping::http_response_carries_status_and_body ... ok803test plugin::host::tests::response_shaping::invalid_http_utf8_is_an_error_not_an_empty_success ... ok804test plugin::host::tests::statement_is_read_only::a_cte_select_is_allowed ... ok805test plugin::host::tests::statement_is_read_only::a_second_statement_is_rejected ... ok806test plugin::host::tests::statement_is_read_only::a_single_trailing_semicolon_is_allowed ... ok807test plugin::host::tests::statement_is_read_only::a_write_hidden_behind_a_comment_is_rejected ... ok808test plugin::host::tests::statement_is_read_only::plain_select_is_allowed ... ok809test plugin::host::tests::statement_is_read_only::writes_are_rejected ... ok810test plugin::host::tests::wrap_select::strips_a_trailing_semicolon_before_wrapping ... ok811test plugin::host::tests::wrap_select::wraps_as_a_bounded_row_query ... ok812test plugin::manifest::tests::accepts_all_published_business_events ... ok813test plugin::manifest::tests::config_defaults_to_empty_when_absent ... ok814test plugin::manifest::tests::parse_valid_manifest ... ok815test plugin::manifest::tests::parses_optional_config_table ... ok816test plugin::manifest::tests::reject_empty_hooks ... ok817test plugin::manifest::tests::reject_unknown_hook ... ok818test plugin::host::tests::database_queries_preserve_parameters_and_rollback_session_settings ... ok819test jobs::tests::synthetic_job_executes_through_claim_and_completion ... ok820test plugin::host::tests::database_tests::query_discards_session_advisory_locks ... ok821test plugin::host::tests::database_tests::query_results_are_bounded_without_silent_truncation ... ok822test plugin::host::tests::database_tests::select_cannot_write_or_gain_application_privileges ... ok823824running 1 test825test plugin::registry::tests::initialization::guest_initializers_have_an_engine_instruction_budget ... ok826827test result: ok. 1 passed; 0 failed; 0 ignored; 0 measured; 903 filtered out; finished in 0.28s828829830running 1 test831test plugin::registry::tests::initialization::guest_initializers_have_an_engine_instruction_budget ... ok832833test result: ok. 1 passed; 0 failed; 0 ignored; 0 measured; 903 filtered out; finished in 0.29s834835836running 1 test837test plugin::registry::tests::initialization::guest_initializers_have_an_engine_instruction_budget ... ok838839test result: ok. 1 passed; 0 failed; 0 ignored; 0 measured; 903 filtered out; finished in 0.52s840841842running 1 test843test plugin::registry::tests::initialization::guest_initializers_have_an_engine_instruction_budget ... ok844845test result: ok. 1 passed; 0 failed; 0 ignored; 0 measured; 903 filtered out; finished in 0.44s846847test plugin::registry::tests::initialization::guest_initializers_have_an_engine_instruction_budget ... ok848test plugin::host::tests::a_query_cannot_disable_its_own_deadline ... ok849test plugin::registry::tests::initialization::instruction_budget_is_replenished_for_each_call ... ok850test plugin::registry::tests::isolation::cancelling_a_waiter_keeps_capacity_reserved_until_the_host_call_exits ... ok851test plugin::host::tests::database_tests::wasm_host_uses_the_restricted_connection_on_a_current_thread_runtime ... ok852test plugin::registry::tests::isolation::confirmed_dispatch_returns_overload_for_retry ... ok853test plugin::registry::tests::isolation::confirmed_dispatch_attempts_other_plugins_after_one_fails ... ok854test plugin::registry::tests::isolation::confirmed_dispatch_waits_for_the_plugin_to_finish ... ok855test plugin::registry::tests::isolation::different_plugins_share_the_running_call_limit ... ok856test plugin::registry::tests::isolation::events_execute_outside_the_async_worker ... ok857test plugin::registry::tests::isolation::confirmed_dispatch_returns_plugin_failure_for_retry ... ok858test plugin::registry::tests::isolation::a_wasm_timeout_releases_the_worker_and_instance ... ok859test plugin::registry::tests::isolation::oversized_event_payloads_are_not_queued ... ok860test plugin::registry::tests::isolation::loaded_plugins_cannot_start_with_excessive_memory ... ok861test plugin::registry::tests::isolation::oversized_wasm_output_is_rejected_before_copying_it ... ok862test plugin::registry::tests::isolation::pending_capacity_rejects_new_work_without_spawning_tasks ... ok863test plugin::registry::tests::load_empty_directory ... ok864test plugin::registry::tests::load_nonexistent_directory ... ok865test plugin::registry::tests::isolation::widgets_execute_outside_the_async_worker ... ok866test plugin::registry::tests::isolation::loaded_plugins_cannot_grow_memory_past_the_limit ... ok867test reports::bounded::tests::cancelled_export_keeps_its_slot_until_the_renderer_exits ... ok868test reports::bounded::tests::export_admission_stays_reserved_until_the_body_is_dropped ... ok869test reports::bounded::tests::export_rendering_runs_off_the_async_worker ... ok870test reports::bounded::tests::output_budget_checks_writes_and_seeks_without_truncation ... ok871test reports::bounded::tests::rendered_output_limit_rejects_oversized_files_and_releases_admission ... ok872test render::tests::invoice_template_formats_large_minor_units_exactly ... ok873test reports::bounded::tests::renderer_errors_and_panics_release_admission ... ok874test plugin::registry::tests::collect_widgets_from_echo_plugin ... ok875test plugin::registry::tests::dispatch_event_with_no_subscribers ... ok876test plugin::registry::tests::load_test_plugins ... ok877test reports::bounded::tests::timed_out_export_keeps_its_slot_until_the_renderer_exits ... ok878test reports::limits::tests::bounded_entries_enforce_the_row_limit_after_all_filters ... ok879test reports::limits::tests::bounded_entries_reject_large_fields_and_combined_text ... ok880test reports::limits::tests::bounded_exports_preserve_real_workbooks_and_deterministic_pdf ... ok881test reports::limits::tests::export_size_checks_and_reads_share_a_repeatable_read_snapshot ... ok882test plugin::registry::tests::dispatch_invoice_sent_to_echo_plugin ... ok883test reports::limits::tests::measure_bounded_export_limits ... ignored, manual release export measurement; set HORAE_EXPORT_PROBE_DIR for artifacts884test plugin::registry::tests::dispatch_to_echo_plugin_succeeds ... ok885test plugin::registry::tests::failing_plugin_does_not_block_caller ... ok886test reports::limits::tests::bounded_invoice_limits_include_branding_and_preserve_tenant_scope ... ok887test reports::streaming::database_tests::a_real_database_error_interrupts_the_csv_body ... ok888test reports::limits::tests::tag_filter_applies_before_xlsx_size_checks_and_rendering ... ok889test reports::streaming::database_tests::measure_streaming_csv_export ... ignored, Manual release measurement of a 100,000-row CSV download890test reports::limits::tests::export_queries_are_read_only_and_have_a_database_deadline ... ok891test reports::limits::tests::fee_exports_preserve_absent_quantities_and_render_a_real_pdf ... ok892test reports::streaming::database_tests::streamed_invoice_uses_stored_exact_cents_and_tenant_scoped_metadata ... ok893test reports::streaming::database_tests::streamed_projects_preserve_scope_budget_and_tenant_isolation ... ok894test reports::privacy_tests::project_downloads_follow_progress_visibility ... ok895test reports::limits::tests::invoice_exports_show_saved_adjustments_and_exact_large_amounts ... ok896test reports::streaming::database_tests::streamed_invoice_metadata_and_lines_share_one_snapshot ... ok897test reports::streaming::tests::completed_csv_keeps_admission_until_body_drop ... ok898test reports::streaming::tests::csv_backpressure_and_body_drop_bound_and_cancel_source_reads ... ok899test reports::streaming::tests::csv_does_not_truncate_a_quoted_unicode_record_larger_than_a_chunk ... ok900test reports::streaming::tests::csv_emits_a_chunk_before_the_source_finishes ... ok901test reports::streaming::tests::csv_failure_or_panic_after_a_chunk_is_not_successful_eof ... ok902test reports::streaming::tests::csv_startup_errors_are_http_errors_and_release_admission ... ok903test reports::streaming::database_tests::streamed_tag_filter_excludes_other_projects_without_duplicating_rows ... ok904test reports::streaming::tests::dropping_csv_during_startup_cancels_the_producer ... ok905test route::tests::client_detail_preserves_identity_and_highlights_only_clients ... ok906test route::tests::client_workflow_paths_preserve_context_and_navigation_section ... ok907test route::tests::edit_project_preserves_identity_and_highlights_only_projects ... ok908test route::tests::malformed_context_reaches_the_workflow_for_validation_after_recovery ... ok909test route::tests::new_project_is_static_and_highlights_only_projects ... ok910test reports::streaming::tests::csv_timeout_interrupts_an_already_started_body ... ok911test reports::streaming::database_tests::streamed_timesheet_exceeds_xlsx_row_limit_without_one_large_body_chunk ... ok912test seed::tests::concurrent_seed_runs_create_only_one_demo ... ok913test seed::tests::concurrent_init_and_seed_cannot_mix_organizations ... ok914test reports::streaming::database_tests::dropping_streamed_timesheet_closes_its_database_connection ... ok915test seed::tests::concurrent_initializers_cannot_create_two_organizations ... ok916test reports::streaming::database_tests::streamed_timesheet_preserves_csv_escaping_frozen_zero_and_all_filters ... ok917test seed::tests::repeated_seed_preserves_every_row_and_user_edits ... ok918test reports::privacy_tests::unauthorized_project_text_does_not_affect_export_size_limits ... ok919test server_fns::approvals::submission_tests::cancelling_a_submission_releases_its_write_barrier ... ok920test server_fns::approvals::submission_tests::submission_barrier_allows_shared_writers_for_the_same_user ... ok921test seed::tests::seed_refuses_an_initialized_organization_without_writes ... ok922test server_fns::approvals::submission_tests::submission_accepts_the_organizations_sunday_start ... ok923test server_fns::approvals::submission_tests::submission_does_not_wait_for_another_users_writer ... ok924test server_fns::approvals::submission_tests::submission_freezes_the_minutes_after_a_competing_edit ... ok925test server_fns::approvals::submission_tests::submission_rejects_a_start_that_is_not_the_organizations_week_start ... ok926test server_fns::approvals::submission_tests::submission_uses_one_pool_connection ... ok927test server_fns::approvals::submission_tests::submission_waits_for_a_new_timer_before_checking_the_week ... ok928test server_fns::approvals::tests::ignores_stopped_and_out_of_week_timers ... ok929test reports::limits::tests::bounded_projects_filter_archives_before_size_checks ... ok930test server_fns::budget_tests::budget_notification_schema_enforces_tenants_and_no_public_access ... ok931test server_fns::approvals::tests::sees_a_running_timer_inside_the_week ... ok932test server_fns::budget_tests::concurrent_budget_checks_have_one_band_claimant ... ok933test seed::tests::seed_leaves_an_older_or_partial_demo_unchanged ... ok934test server_fns::budget_tests::configured_alert_and_outbox_roll_back_together ... ok935test server_fns::budget_tests::configured_alert_recipients_are_active_same_org_managers_and_project_leads ... ok936test server_fns::budget_tests::configured_alerts_deduplicate_concurrent_checks_and_recrossing ... ok937test server_fns::budget_tests::configured_alerts_require_enabled_active_project_and_authorized_recipient ... ok938test reports::streaming::database_tests::streamed_fee_invoice_has_no_fabricated_hours_or_hourly_rate ... ok939test server_fns::budget_tests::configured_amount_budget_uses_resolved_rates_and_explicit_zero ... ok940test server_fns::budget_tests::configured_budget_sweep_recovers_missed_checks_without_duplicates ... ok941test server_fns::budget_tests::configured_budget_does_not_read_foreign_or_legacy_projects ... ok942test server_fns::budget_tests::configured_monthly_budget_excludes_other_months_and_nonbillable_time ... ok943test seed::tests::seed_refuses_a_second_organization_even_when_the_demo_exists ... ok944test server_fns::budget_tests::configured_nonbillable_projects_count_time_without_hidden_checkbox ... ok945test server_fns::budget_tests::configured_person_budget_excludes_other_people_and_has_its_own_alert ... ok946test server_fns::budget_tests::configured_task_and_person_budgets_do_not_share_consumption ... ok947test server_fns::budget_tests::configured_task_fee_budget_respects_billability_and_alert_scope ... ok948test server_fns::budget_tests::configured_monthly_budget_includes_leap_day_and_preserves_locked_rounding ... ok949test server_fns::budget_tests::overview_budget_progress_batches_projects_without_mixing_scopes ... ok950test seed::tests::late_seed_failure_rolls_back_all_demo_data ... ok951test server_fns::clients::tests::client_default_rate_allows_detail_edits_and_equivalent_currency ... ok952test server_fns::clients::tests::client_details_distinguish_unset_zero_and_positive_manager_rates ... ok953test server_fns::clients::tests::both_activation_transitions_change_once_and_preserve_details ... ok954test server_fns::clients::tests::client_default_rate_prevents_currency_relabelling ... ok955test server_fns::budget_tests::overview_budget_progress_includes_people_without_an_allowance ... ok956test server_fns::budget_tests::overview_budget_progress_is_current_period_scoped_and_authorized ... ok957test server_fns::clients::tests::client_details_hide_foreign_missing_and_inactive_actor_records ... ok958test server_fns::clients::tests::client_details_keep_catalog_identity_but_omit_member_billing ... ok959test server_fns::clients::tests::client_invoices_require_manager_authority_even_without_invoices ... ok960test server_fns::clients::tests::client_invoices_reject_a_winning_concurrent_revocation ... ok961test server_fns::clients::tests::client_invoices_hold_authority_until_the_read_finishes ... ok962test server_fns::clients::tests::client_summaries_exclude_foreign_clients_and_unreadable_project_currencies ... ok963test server_fns::clients::tests::client_invoices_keep_exact_client_scope_statuses_and_currencies ... ok964test server_fns::clients::tests::client_summaries_keep_catalog_without_projects_and_count_archived_projects ... ok965test server_fns::clients::tests::client_summaries_follow_existing_progress_visibility_and_revoke_inactive_users ... ok966test server_fns::clients::tests::each_field_changes_once_and_preserves_inactive_status ... ok967test server_fns::clients::tests::client_summaries_reject_a_foreign_actor_even_when_client_org_is_known ... ok968test server_fns::clients::tests::concurrent_deletion_is_not_an_unchanged_mutation ... ok969test server_fns::clients::tests::currency_edit_rechecks_a_concurrently_added_client_default_rate ... ok970test server_fns::clients::tests::missing_and_foreign_clients_are_not_noops ... ok971test server_fns::clients::tests::profile_currency_change_without_a_rate_keeps_it_unset ... ok972test server_fns::clients::tests::profile_create_persists_normalized_identity_and_exact_optional_rate ... ok973test server_fns::clients::tests::profile_noop_preserves_row_and_returns_no_update_event_signal ... ok974test server_fns::clients::tests::profile_saves_reject_invalid_input_without_partial_writes ... ok975test server_fns::clients::tests::profile_saves_recheck_manager_org_and_active_actor ... ok976test server_fns::clients::tests::profile_update_rechecks_authority_after_waiting_for_a_concurrent_demotion ... ok977test server_fns::clients::tests::profile_update_preserves_historical_rows_and_inactive_status ... ok978test server_fns::clients::tests::profile_update_rejects_stale_currency_even_when_the_rate_is_still_unset ... ok979test server_fns::clients::tests::profile_update_rejects_stale_rate_even_when_the_target_currency_is_unchanged ... ok980test server_fns::clients::tests::profile_update_rechecks_financial_snapshot_after_waiting_for_a_concurrent_edit ... ok981test server_fns::importers::authorization_tests::cli_job_endpoints_have_stable_registered_paths ... ok982test server_fns::clients::tests::restoring_a_competing_deactivation_reports_reactivation ... ok983test server_fns::importers::authorization_tests::report_stress::large_report_streams_over_http_without_buffering_the_archive ... ignored, isolated Linux HTTP/memory stress; run with --release --exact --ignored --nocapture984test server_fns::importers::authorization_tests::request_bound_import_endpoints_are_not_registered ... ok985test server_fns::importers::csv_upload::tests::csv_upload_extractor_preserves_raw_bytes ... ok986test server_fns::importers::csv_upload::tests::csv_upload_requires_its_header_without_reading_the_body ... ok987test server_fns::importers::tests::concurrent_api_import_returns_a_retryable_conflict ... ok988test server_fns::clients::tests::profile_update_requires_explicit_rate_intent_for_currency_changes ... ok989test server_fns::importers::tests::submission_identity_rejects_expired_future_and_non_v7_keys ... ok990test server_fns::importers::tests::csv_route_rejects_invalid_modes_and_headers_without_reading_uploads ... ok991test server_fns::clients::tests::repeating_a_competing_edit_does_not_report_a_change ... ok992test server_fns::clients::tests::repeating_a_competing_deactivation_does_not_report_a_transition ... ok993test server_fns::clients::tests::restoring_values_after_a_competing_edit_reports_a_change ... ok994test server_fns::clients::tests::unchanged_activation_preserves_the_row ... ok995test server_fns::clients::tests::unchanged_edit_preserves_the_row ... ok996test server_fns::invoices::fee_tests::concurrent_invoices_claim_a_single_fee_once ... ok997test server_fns::importers::authorization_tests::job_endpoints_enforce_session_role_and_organization ... FAILED998test server_fns::invoices::fee_tests::fee_invoice_does_not_claim_hours_or_another_clients_fee ... ok999test server_fns::invoices::fee_tests::concurrent_discounted_invoice_retries_return_one_invoice ... ok1000test server_fns::invoices::fee_tests::fee_occurrence_rejects_cross_organization_project ... ok1001test server_fns::invoices::fee_tests::draft_fee_edit_requires_current_balance_and_exact_excess_confirmation ... ok1002test server_fns::invoices::fee_tests::fee_total_overflow_rolls_back_occurrences_and_invoice ... ok1003test server_fns::invoices::fee_tests::discounted_fee_leaves_a_balance_and_void_releases_only_its_contribution ... ok1004test server_fns::invoices::fee_tests::invoice_line_sources_reject_mixed_sources_and_invented_fee_quantities ... ok1005test server_fns::invoices::fee_tests::fee_balance_migration_allocates_discount_without_rewriting_invoice_snapshots ... ok1006test server_fns::invoices::fee_tests::draft_fee_edit_rejects_invalid_lines_and_current_unauthorized_actors ... ok1007test server_fns::invoices::fee_tests::milestones_include_unbilled_overdue_fees_but_not_future_fees ... ok1008test server_fns::invoices::fee_tests::draft_fee_edit_serializes_retries_and_rejects_stale_revisions ... ok1009test server_fns::invoices::fee_tests::invoice_preview_does_not_materialize_fees_and_preserves_released_snapshots ... ok1010test server_fns::invoices::fee_tests::monthly_fees_use_calendar_dates_and_skip_already_claimed_months ... ok1011test server_fns::invoices::fee_tests::monthly_first_and_fifteenth_respect_partial_period_and_project_end ... ok1012test server_fns::invoices::fee_tests::invoice_defaults_apply_to_selected_fees_without_claiming_other_projects ... ok1013test server_fns::invoices::fee_tests::project_fee_context_matches_invoice_balances_and_current_authority ... ok1014test server_fns::invoices::fee_tests::removing_discount_and_billing_the_remainder_cannot_both_succeed ... ok1015test server_fns::invoices::fee_tests::project_fee_context_keeps_monthly_balances_separate ... ok1016test server_fns::invoices::fee_tests::prepared_fee_selection_rejects_invalid_values_and_empty_generation ... ok1017test server_fns::invoices::fee_tests::reviewed_generation_bills_partial_fees_and_rejects_stale_balances ... ok1018test server_fns::invoices::fee_tests::fee_preview_discount_ties_follow_source_keys_not_display_dates ... ok1019test server_fns::invoices::fee_tests::fee_preview_keeps_source_identity_and_reports_discounted_draft_balances ... ok1020test server_fns::invoices::fee_tests::single_fee_can_be_invoiced_without_time ... ok1021test server_fns::invoices::fee_tests::invoice_status_rechecks_authority_after_waiting_for_the_invoice_lock ... ok1022test server_fns::invoices::fee_tests::void_releases_fee_identity_without_rewriting_the_original_line ... ok1023test server_fns::invoices::preview::tests::excess_rejects_an_unrepresentable_total_even_when_the_remainder_fits ... ok1024test server_fns::invoices::preview::tests::unselected_fee_currencies_do_not_relabel_or_block_selected_charges ... ok1025test server_fns::invoices::fee_tests::zero_fee_is_invoiced_once_until_voided ... ok1026test server_fns::invoices::tests::configured_fixed_fee_hours_are_not_invoiced_but_legacy_fees_are_unchanged ... ok1027test server_fns::invoices::fee_tests::mixed_time_and_fee_discount_conserves_cents_without_reopening_time ... ok1028test server_fns::invoices::tests::billing_cascade_agrees_across_all_four_levels_including_zero ... ok1029test server_fns::invoices::tests::effective_minutes_migration_preserves_historical_invoice_quantities ... ok1030test server_fns::invoices::tests::configured_project_currency_and_cost_override_keep_their_denominations ... ok1031test server_fns::invoices::fee_tests::draft_fee_edit_replaces_amount_and_preserves_source_and_retry_identity ... ok1032test server_fns::invoices::fee_tests::settled_fee_sources_remain_reviewable_without_automatic_charges ... ok1033test server_fns::invoices::fee_tests::reviewed_generation_rejects_changed_time_before_claiming_it ... ok1034test server_fns::invoices::tests::invoice_defaults_are_invoice_owned_and_only_drafts_are_editable ... ok1035test server_fns::invoices::tests::effective_minutes_sql_matches_domain_rounding ... ok1036test server_fns::invoices::tests::invoice_defaults_conflict_rolls_back_all_claims ... ok1037test server_fns::invoices::fee_tests::reviewed_generation_requires_exact_excess_and_current_authority ... ok1038test server_fns::invoices::fee_tests::reviewed_generation_does_not_materialize_unselected_months ... ok1039test server_fns::invoices::tests::invoice_defaults_validate_all_override_fields ... ok1040test server_fns::invoices::tests::invoice_line_overflow_leaves_time_unbilled ... ok1041test server_fns::invoices::tests::invoice_defaults_edit_rechecks_status_after_waiting_for_a_concurrent_send ... ok1042test server_fns::invoices::tests::invoice_defaults_selection_rejects_unavailable_projects_before_claiming ... ok1043test server_fns::invoices::tests::imported_rates::imported_legacy_project_keeps_exact_rates_and_totals_on_retry ... ok1044test server_fns::invoices::tests::invoice_defaults_apply_exact_adjustments_and_payment_terms ... ok1045test server_fns::invoices::tests::invoice_total_overflow_leaves_all_time_unbilled ... ok1046test server_fns::invoices::tests::invoice_preview_keeps_time_rates_and_defaults_in_one_snapshot ... ok1047test server_fns::invoices::tests::invoice_transitions_reject_invalid_states_and_foreign_organizations ... ok1048test server_fns::invoices::tests::invoiced_amounts_survive_rate_changes_and_void_uses_current_rates ... ok1049test server_fns::invoices::tests::invoiced_billability_survives_later_project_changes ... ok1050test server_fns::invoices::tests::invoicing_leaves_running_time_open ... ok1051test server_fns::invoices::tests::large_invoice_and_reports_agree_without_intermediate_overflow ... ok1052test server_fns::invoices::tests::invoicing_uses_and_freezes_effective_minutes ... ok1053test server_fns::invoices::tests::invoice_preview_rejects_large_results_instead_of_truncating_them ... ok1054test server_fns::invoices::tests::mixed_project_currencies_cannot_partially_create_an_invoice ... ok1055test server_fns::invoices::tests::only_running_time_does_not_create_an_invoice ... ok1056test server_fns::invoices::tests::non_billable_context_produces_no_unbilled_amount_on_any_report ... ok1057test server_fns::invoices::tests::imported_rates::imported_task_rates_require_matching_currency_only_for_new_configured_links ... ok1058test server_fns::invoices::tests::project_rate_is_used_by_invoices_reports_and_spend ... ok1059test server_fns::invoices::tests::void_reopens_time_without_stale_rounding ... ok1060test server_fns::invoices::tests::void_waits_for_a_concurrent_payment_and_then_refuses ... ok1061test server_fns::invoices::tests::invoice_defaults_legacy_insert_preserves_dates_and_exact_total ... ok1062test server_fns::organization::tests::missing_organization_is_not_an_unchanged_update ... ok1063test server_fns::organization::tests::each_branding_field_changes_once_including_null_and_empty ... ok1064test server_fns::invoices::tests::selected_project_rate_modes_agree_across_billing_consumers ... ok1065test server_fns::organization::tests::restoring_branding_after_a_competing_edit_reports_a_change ... ok1066test server_fns::invoices::tests::imported_rates::rejected_import_rate_does_not_poison_the_next_row_or_its_catalog_rate ... ok1067test server_fns::organization::tests::repeating_a_competing_branding_edit_does_not_report_a_change ... ok1068test server_fns::organization::tests::unchanged_branding_preserves_the_row ... ok1069test server_fns::invoices::tests::invoice_preview_requires_explicit_resolution_and_scopes_selected_projects ... ok1070test server_fns::invoices::tests::invoice_preview_matches_generation_without_claiming_time ... ok1071test server_fns::permissions::own_tests::own_permissions_deny_invalid_identity_policy_and_state ... ok1072test server_fns::permissions::own_tests::own_permissions_preserve_exact_grants_and_independent_identity ... ok1073test server_fns::permissions::own_tests::own_permissions_wait_for_current_actor_deactivation ... ok1074test server_fns::permissions::profile_tests::adjusted_template_reset_and_replay_after_deletion_use_explicit_intent ... ok1075test server_fns::permissions::own_tests::own_permissions_legacy_mode_never_discloses_staging ... ok1076test server_fns::permissions::profile_tests::audit_failure_rolls_back_profile_and_both_relationship_sets ... ok1077test server_fns::permissions::profile_tests::cancelled_profile_save_rolls_back_effects_and_releases_single_connection ... ok1078test server_fns::permissions::profile_tests::canonical_actor_policy_tenant_and_target_checks_precede_mutation ... ok1079test server_fns::permissions::profile_tests::all_grant_template_cannot_confer_identity_and_cross_command_keys_conflict ... ok1080test server_fns::permissions::profile_tests::existing_user_share_lock_does_not_block_profile_command ... ok1081test server_fns::permissions::profile_tests::explicit_application_and_adjustments_preserve_confirmed_grants ... ok1082test server_fns::permissions::profile_tests::explicit_identity_changes_and_inactive_targets_do_not_change_activation ... ok1083test server_fns::permissions::profile_tests::invalid_confirmations_and_noncanonical_grants_are_not_silently_repaired ... ok1084test server_fns::permissions::profile_tests::malformed_person_or_remaining_administrator_state_fails_closed ... ok1085test server_fns::permissions::profile_tests::profile_command_rechecks_remaining_administrator_after_deactivation_wait ... ok1086test server_fns::permissions::profile_tests::last_active_administrator_cannot_be_demoted_or_replaced_by_equivalent_grants ... ok1087test server_fns::permissions::profile_tests::profile_command_retains_target_activity_through_receipt_insert ... ok1088test server_fns::permissions::profile_tests::profile_command_overrides_readonly_defaults_locally ... ok1089test server_fns::permissions::profile_tests::profile_demotion_retains_surviving_administrator_until_commit ... ok1090test server_fns::permissions::profile_tests::profile_command_waits_for_direct_actor_deactivation_even_on_replay ... ok1091test server_fns::permissions::profile_tests::recreated_relationship_invalidates_waiting_confirmation_without_partial_removal ... ok1092test server_fns::permissions::profile_tests::reduced_administrator_and_stale_person_proposals_are_rejected ... ok1093test server_fns::permissions::own_tests::own_permissions_reader_retains_actor_activity_until_snapshot_is_loaded ... ok1094test server_fns::permissions::profile_tests::simultaneous_losses_require_exact_confirmation_preserve_history_and_never_restore_links ... ok1095test server_fns::permissions::own_tests::own_permissions_scope_is_sorted_and_excludes_membership_and_other_managers ... ok1096test server_fns::permissions::own_tests::own_permissions_reload_after_winning_gate_under_repeatable_read_defaults ... ok1097test server_fns::permissions::profile_tests::unchanged_edit_preserves_identity_source_timestamp_and_revisions ... ok1098test server_fns::permissions::profile_tests::profile_command_rechecks_target_activation_before_demotion ... ok1099test server_fns::permissions::profile_tests::stale_template_and_org_revision_and_exhausted_revisions_roll_back ... ok1100test server_fns::permissions::profile_tests::concurrent_self_demotions_leave_one_active_explicit_administrator ... ok1101test server_fns::permissions::storage_tests::malformed_stored_grants_fail_without_repair ... ok1102test server_fns::permissions::profile_tests::management_schema_rejects_foreign_parents_self_links_and_duplicate_pairs ... ok1103test server_fns::permissions::storage_tests::concurrent_equivalent_names_create_only_one_template ... ok1104test server_fns::permissions::storage_tests::person_state_rejects_duplicates_and_foreign_users_and_templates ... ok1105test server_fns::permissions::profile_tests::unchanged_and_unrelated_edits_do_not_clean_up_preexisting_incompatible_links ... ok1106test server_fns::permissions::storage_tests::source_shape_and_revision_constraints_reject_invalid_rows ... ok1107test server_fns::permissions::storage_tests::unicode_name_collision_rolls_back_migration_without_changing_profiles ... ok1108test server_fns::permissions::storage_tests::unicode_name_migration_preserves_existing_templates ... ok1109test server_fns::permissions::storage_tests::template_names_are_case_insensitive_and_tenant_local ... ok1110test server_fns::permissions::template_tests::command_receipts_are_not_shared_between_administrators ... ok1111test server_fns::permissions::template_tests::actor_share_lock_does_not_block_template_command ... ok1112test server_fns::permissions::profile_tests::revocation_winning_gate_denies_new_and_replayed_changes ... ok1113test server_fns::permissions::template_tests::concurrent_creators_never_exceed_fifty_profiles ... ok1114test server_fns::permissions::template_tests::create_canonical_retry_returns_one_historical_change ... ok1115test server_fns::permissions::template_tests::delete_replay_does_not_touch_a_same_name_replacement ... ok1116test server_fns::permissions::storage_tests::storage_does_not_activate_or_infer_legacy_roles ... ok1117test server_fns::permissions::template_tests::delete_preserves_adjusted_grants_identity_and_business_rows ... ok1118test server_fns::permissions::profile_tests::read_only_retention_and_explicit_keep_project_access_preserve_independent_person_losses ... ok1119test server_fns::permissions::storage_tests::person_grants_and_identity_round_trip_independently_of_source ... ok1120test server_fns::permissions::template_tests::invalid_stored_authority_and_template_grants_fail_closed ... ok1121test server_fns::permissions::template_tests::receipts_enforce_tenant_exclusive_principal_and_request_uniqueness ... ok1122test server_fns::permissions::template_tests::concurrent_exact_retry_creates_one_receipt_without_changing_people ... ok1123test server_fns::permissions::storage_tests::referenced_template_deletion_requires_detaching_without_grant_or_identity_loss ... ok1124test server_fns::permissions::template_tests::template_command_overrides_readonly_defaults_and_keeps_stricter_timeouts ... ok1125test server_fns::permissions::template_tests::template_command_waits_for_direct_actor_deactivation_on_replay ... ok1126test server_fns::permissions::template_tests::unknown_grants_and_authority_fields_cannot_deserialize_as_commands ... ok1127test server_fns::permissions::storage_tests::additive_migration_preserves_populated_legacy_records ... ok1128test server_fns::project_creation::assignment_tests::finalization_reuses_catalog_and_keeps_lead_overrides_local_on_retry ... ok1129test server_fns::permissions::template_tests::equivalent_names_and_invalid_confirmed_selections_roll_back ... ok1130test server_fns::permissions::template_tests::unsupported_receipt_version_fails_without_repeating_the_change ... ok1131test server_fns::project_creation::editing::tests::concurrent_edits_have_one_winner_and_association_writes_invalidate_open_forms ... ok1132test server_fns::project_creation::assignment_tests::invalid_assignment_graphs_leave_no_partial_creation_or_draft_change ... ok1133test server_fns::permissions::template_tests::stale_foreign_and_exhausted_revisions_never_partially_delete ... ok1134test server_fns::project_creation::editing::tests::editing_milestones_keeps_invoice_snapshots_and_fee_identities_immutable ... ok1135test server_fns::project_creation::editing::tests::editor_keeps_archived_selected_identities_and_nullable_overrides ... ok1136test server_fns::project_creation::editing::tests::editor_loads_legacy_values_without_fabricating_a_billing_mode_or_draft ... ok1137test server_fns::permissions::template_tests::malformed_assignee_aborts_all_detachments ... ok1138test server_fns::project_creation::editing::tests::editor_preserves_fee_schedule_and_operational_milestone_ids ... ok1139test server_fns::project_creation::editing::tests::editor_rechecks_tenant_role_and_active_status ... ok1140test server_fns::project_creation::editing::tests::editor_recovers_each_budget_scope_without_turning_absence_into_zero ... ok1141test server_fns::project_creation::editing::tests::editor_recovers_full_configuration_and_redacts_private_values_after_role_change ... ok1142test server_fns::project_creation::editing::tests::foreign_actor_cannot_save_or_retry_another_organizations_edit ... ok1143test server_fns::project_creation::editing::tests::manager_edit_preserves_private_settings_and_cannot_remove_them_indirectly ... ok1144test server_fns::project_creation::editing::tests::save_preserves_recorded_time_and_rejects_removing_its_task_or_person ... ok1145test server_fns::project_creation::editing::tests::save_edits_the_same_legacy_project_and_never_creates_a_draft_or_configuration ... ok1146test server_fns::project_creation::editing::tests::editor_load_uses_current_role_across_all_billing_configurations ... ok1147test server_fns::project_creation::editing::tests::save_updates_configured_sections_atomically_and_rejects_stale_or_invalid_edits ... ok1148test server_fns::project_creation::editing::tests::saves_recheck_current_authority_and_do_not_repeat_noops ... ok1149test server_fns::project_creation::editing::tests::task_catalog_and_graph_changes_roll_back_together_on_duplicate_resolution ... ok1150test server_fns::project_creation::tests::billing_schema_rejects_partial_fee_schedules ... ok1151test server_fns::permissions::template_tests::revocation_winning_org_gate_denies_pending_replay_and_new_command ... ok1152test server_fns::project_creation::tests::client_dialog_validates_details_and_persists_an_explicit_zero_rate ... ok1153test server_fns::project_creation::tests::creation_actor_is_revalidated_inside_the_transaction ... ok1154test server_fns::project_creation::tests::creation_client_must_be_active_and_in_the_same_organization ... ok1155test server_fns::permissions::template_tests::failed_audit_insert_rolls_back_creation_and_detachment ... ok1156test server_fns::project_creation::tests::creation_options_are_scoped_bounded_and_redact_manager_costs ... ok1157test server_fns::project_creation::tests::draft_save_retries_do_not_overwrite_a_newer_revision ... ok1158test server_fns::project_creation::tests::draft_validation_preserves_incomplete_input_but_bounds_its_size ... ok1159test server_fns::project_creation::tests::draft_ownership_discard_and_role_changes_are_enforced ... ok1160test server_fns::project_creation::tests::final_validation_checks_invoice_defaults_and_scoped_budget_totals ... ok1161test server_fns::project_creation::tests::final_validation_preserves_exact_budgets_and_rejects_unavailable_email ... ok1162test server_fns::project_creation::tests::final_validation_requires_complete_fee_schedules_and_distinct_entities ... ok1163test server_fns::project_creation::tests::final_validation_requires_real_details_and_ignores_hidden_type_settings ... ok1164test server_fns::project_creation::tests::draft_schema_enforces_one_current_draft_per_creator ... ok1165test server_fns::project_creation::tests::draft_schema_rejects_foreign_creator_and_completed_project ... ok1166test server_fns::permissions::template_tests::legacy_future_missing_foreign_and_non_admin_authority_deny ... ok1167test server_fns::project_creation::tests::existing_projects_have_no_implicit_new_billing_configuration ... ok1168test server_fns::project_creation::tests::managers_cannot_store_administrator_notes_or_costs_in_a_draft ... ok1169test server_fns::project_creation::tests::finalization_persists_task_access_and_project_only_financial_overrides ... ok1170test server_fns::project_creation::tests::draft_schema_rejects_oversize_payload_and_invalid_revision ... ok1171test server_fns::project_creation::tests::finalization_rechecks_client_role_revision_and_rate_currency ... ok1172test server_fns::project_creation::tests::invalid_task_rolls_back_project_and_keeps_the_draft ... ok1173test server_fns::project_creation::tests::finalize_is_atomic_and_repeated_submission_returns_one_project ... ok1174test server_fns::project_creation::validation::tests::assignment_rejections_identify_the_invalid_row ... ok1175test server_fns::project_creation::validation::tests::basic_rejections_identify_the_field_without_echoing_input ... ok1176test server_fns::project_creation::validation::tests::billing_rejections_identify_the_active_control ... ok1177test server_fns::project_creation::validation::tests::inactive_billing_inputs_remain_in_the_draft_without_blocking_creation ... ok1178test server_fns::project_creation::validation::tests::invoice_rejections_identify_the_field_without_echoing_input ... ok1179test server_fns::project_creation::validation::tests::milestone_rejections_target_the_invalid_row_by_identity ... ok1180test server_fns::project_creation::validation::tests::non_billable_projects_ignore_hidden_invoice_inputs ... ok1181test server_fns::project_creation::validation::tests::task_name_and_access_rejections_identify_the_invalid_row ... ok1182test server_fns::project_creation::tests::selected_catalog_bounds_requests_and_excludes_inactive_people ... ok1183test server_fns::project_creation::tests::missing_draft_responses_do_not_disclose_foreign_ownership ... ok1184test server_fns::projects::bulk_tests::bulk_ids_validate_before_writes_and_normalize_duplicates ... ok1185test server_fns::project_creation::tests::selected_catalog_is_scoped_deduplicated_and_redacts_manager_costs ... ok1186test server_fns::project_creation::tests::selected_client_lookup_is_scoped_and_keeps_archived_identity ... ok1187test server_fns::project_creation::tests::simultaneous_draft_updates_have_one_winner ... ok1188test server_fns::projects::bulk_tests::bulk_accepts_one_hundred_projects_and_mixed_status_noops ... ok1189test server_fns::projects::bulk_tests::bulk_database_failure_rolls_back_earlier_changes ... ok1190test server_fns::project_creation::import_tests::imported_catalog_rate_cannot_be_relabelled_as_workspace_currency ... ok1191test server_fns::projects::bulk_tests::bulk_status_preserves_details_history_and_noop_versions ... ok1192test server_fns::projects::bulk_tests::bulk_missing_or_foreign_project_rolls_back_earlier_changes ... ok1193test server_fns::projects::bulk_tests::bulk_reversed_overlapping_batches_finish_without_deadlock ... ok1194test server_fns::projects::bulk_tests::bulk_preserves_invoiced_history_assignments_and_spend ... ok1195test server_fns::projects::mutation_tests::project::both_activation_transitions_preserve_details_and_change_once ... ok1196test server_fns::projects::mutation_tests::project::concurrent_deletion_is_rejected_by_both_mutations ... ok1197test server_fns::projects::mutation_tests::project::budgets_and_rates_distinguish_null_zero_and_normalized_values ... ok1198test server_fns::projects::mutation_tests::project::configured_edits_recheck_settings_after_waiting_for_the_project ... ok1199test server_fns::projects::mutation_tests::project::configured_edits_preserve_compatible_changes_and_idempotence ... ok1200test server_fns::projects::mutation_tests::project::configured_edits_preserve_non_hourly_billing ... ok1201test server_fns::projects::mutation_tests::project::configured_edits_reject_incompatible_financial_changes_atomically ... ok1202test server_fns::projects::mutation_tests::project::inactive_project_edits_preserve_identity_and_reject_implicit_migrations ... ok1203test server_fns::projects::mutation_tests::project::invalid_project_fields_leave_the_row_unchanged ... ok1204test server_fns::projects::mutation_tests::project::missing_and_foreign_rows_are_not_noops ... ok1205test server_fns::project_creation::import_tests::imports_preserve_finalized_project_configuration_and_restricted_access ... ok1206test server_fns::projects::mutation_tests::project::repeating_a_competing_deactivation_reports_no_transition ... ok1207test server_fns::projects::mutation_tests::project::repeating_a_competing_edit_requires_a_fresh_revision ... ok1208test server_fns::projects::mutation_tests::project::restoring_a_competing_deactivation_reports_reactivation ... ok1209test server_fns::projects::mutation_tests::project::restoring_a_competing_edit_does_not_overwrite_the_other_session ... ok1210test server_fns::projects::mutation_tests::project::unchanged_activation_preserves_the_row ... ok1211test server_fns::projects::mutation_tests::project::unchanged_edit_preserves_the_row ... ok1212test server_fns::projects::details_tests::project_details_and_tags_follow_current_progress_and_private_permissions ... ok1213test server_fns::projects::mutation_tests::task::both_activation_transitions_preserve_details_and_change_once ... ok1214test server_fns::projects::mutation_tests::task::concurrent_deletion_returns_not_found_for_both_mutations ... ok1215test server_fns::projects::mutation_tests::task::each_detail_field_changes_once_and_preserves_inactive_status ... ok1216test server_fns::projects::mutation_tests::task::missing_and_foreign_rows_are_not_noops ... ok1217test server_fns::projects::mutation_tests::task::repeating_a_competing_deactivation_reports_no_transition ... ok1218test server_fns::projects::mutation_tests::task::repeating_a_competing_edit_does_not_report_a_change ... ok1219test server_fns::projects::mutation_tests::task::rate_edits_set_currency_without_relabelling_renames_or_noops ... ok1220test server_fns::projects::mutation_tests::task::restoring_a_competing_deactivation_reports_reactivation ... ok1221test server_fns::projects::details_tests::project_details_only_offer_task_rate_currency_to_current_managers ... ok1222test server_fns::projects::mutation_tests::task::restoring_a_competing_edit_reports_a_change ... ok1223test server_fns::projects::mutation_tests::task::unchanged_activation_preserves_the_row ... ok1224test server_fns::projects::mutation_tests::task::unchanged_edit_preserves_the_row ... ok1225test server_fns::projects::privacy_tests::client_project_filter_preserves_progress_access_and_rate_redaction ... ok1226test server_fns::projects::privacy_tests::legacy_members_retain_progress_without_new_settings ... ok1227test server_fns::projects::details_tests::unlinked_and_private_project_tags_do_not_leak_into_filters ... ok1228test server_fns::projects::privacy_tests::outsiders_and_inactive_viewers_have_no_project_reads ... ok1229test server_fns::projects::privacy_tests::project_members_and_leads_receive_progress_without_rates ... ok1230test server_fns::projects::privacy_tests::private_progress_does_not_prevent_tracking_or_reveal_financial_fields ... ok1231test server_fns::projects::privacy_tests::project_reads_use_current_authority_and_reject_foreign_scope ... ok1232test server_fns::projects::tests::creating_a_project_task_enables_it_with_its_defaults ... ok1233test server_fns::projects::privacy_tests::revoked_membership_preserves_only_own_historical_tracking_identity ... ok1234test server_fns::projects::tests::assignments_are_scoped_to_the_viewers_organization ... ok1235test server_fns::projects::tests::enabling_tasks_rejects_incompatible_catalog_currency ... ok1236test server_fns::projects::tests::enabling_is_tenant_scoped_even_for_existing_links_and_preserves_overrides ... ok1237test server_fns::projects::tests::project_rate_distinguishes_inheritance_zero_and_exact_amounts ... ok1238test server_fns::projects::tests::enabling_tasks_accepts_exact_project_currency_rates_and_preserves_existing_links ... ok1239test server_fns::projects::tests::enabling_tasks_rejects_explicit_rates_unused_by_the_project ... ok1240test server_fns::projects::tests::enabling_tasks_rejects_invalid_or_wrong_currency_explicit_rates_without_linking ... ok1241test server_fns::projects::tests::failed_project_task_creation_leaves_no_orphan_task ... ok1242test server_fns::projects::tests::managers_and_admins_can_read_assignment_rates ... ok1243test server_fns::projects::tests::members_can_list_identities_but_not_assignment_rates ... ok1244test server_fns::projects::tests::enabling_tasks_only_inherits_rates_used_by_configured_projects ... ok1245test server_fns::projects::tests::project_rate_helper_has_no_public_execute_grant ... ok1246test server_fns::projects::tests::project_rate_sql_matches_rust_for_missing_zero_and_present_sources ... ok1247test server_fns::time_entries::tests::a_limit_bounds_a_listing_on_its_own ... ok1248test server_fns::projects::tests::unknown_catalog_currency_requires_explicit_configured_rates_but_preserves_legacy ... ok1249test server_fns::reports::tests::filters_and_renames_keep_report_identity_and_totals ... ok1250test server_fns::time_entries::tests::a_running_timer_cannot_be_moved_to_another_day ... ok1251test server_fns::time_entries::tests::a_reorder_rejects_foreign_missing_timed_and_duplicate_ids ... ok1252test server_fns::time_entries::tests::an_unlimited_listing_needs_both_ends_of_the_range ... ok1253test server_fns::time_entries::tests::admin_may_log_time_without_assignment ... ok1254test server_fns::time_entries::tests::clamps_duration_against_the_snapped_start ... ok1255test server_fns::time_entries::tests::an_open_entry_can_move_into_a_day_with_locked_time ... ok1256test server_fns::reports::tests::manager_report_omits_groups_containing_private_project_costs ... ok1257test server_fns::time_entries::tests::assigned_member_may_log_time ... ok1258test server_fns::time_entries::tests::concurrent_timer_starts_insert_exactly_one_entry ... ok1259test server_fns::time_entries::tests::inactive_project_cannot_accept_new_time_even_for_admin ... ok1260test server_fns::time_entries::tests::moving_locked_time_rejects_the_entire_reorder ... ok1261test server_fns::time_entries::tests::edits_preserve_archived_time_but_cannot_override_non_billability ... ok1262test server_fns::time_entries::tests::rejects_out_of_range_start ... ok1263test server_fns::time_entries::tests::snaps_unaligned_start_to_the_grid ... ok1264test server_fns::reports::tests::report_uses_current_active_actor_and_tenant_for_every_filter ... ok1265test server_fns::time_entries::tests::new_time_and_picker_require_a_project_task_link ... ok1266test server_fns::time_entries::tests::new_time_and_picker_reject_inactive_or_foreign_contexts ... ok1267test server_fns::time_entries::tests::untimed_start_is_left_untouched ... ok1268test server_fns::time_entries::tests::submission_barrier_blocks_edits_and_cross_week_reorders ... ok1269test server_fns::time_entries::tests::submission_barrier_blocks_manual_entries_and_timer_starts ... ok1270test server_fns::reports::tests::shared_person_and_task_are_partitioned_by_currency ... ok1271test server_fns::time_entries::update_tests::competing_identical_edit_is_a_noop_after_the_first_commit ... ok1272test server_fns::time_entries::tests::new_time_uses_effective_billability_for_manual_entries_and_timers ... ok1273test server_fns::time_entries::update_tests::competing_edit_that_restores_old_values_still_reports_a_change ... ok1274test server_fns::time_entries::tests::unassigned_member_is_forbidden ... ok1275test server_fns::time_entries::update_tests::concurrent_lock_or_delete_is_rechecked_before_editing ... ok1276test server_fns::time_entries::update_tests::each_editable_field_changes_once_including_nulls ... ok1277test server_fns::reports::tests::same_names_keep_separate_groups_for_every_dimension ... ok1278test server_fns::time_entries::update_tests::missing_foreign_and_locked_entries_are_not_noops ... ok1279test server_fns::time_entries::update_tests::normalized_noop_preserves_the_row_and_updated_at ... ok1280test server_fns::time_entries::update_tests::effective_billability_noop_preserves_the_row ... ok1281test server_fns::time_entries::update_tests::restricted_empty_task_rejects_changes_and_noop_edits ... ok1282test server_fns::time_entries::update_tests::restricted_empty_task_rejects_picker_manual_and_timer_starts ... ok1283test server_fns::time_entries::update_tests::restricted_reordering_rejects_the_whole_batch ... ok1284test server_fns::time_entries::update_tests::restricted_task_rejects_reschedule_and_delete ... ok1285test server_fns::time_entries::update_tests::restriction_changes_are_rechecked_before_manual_or_timer_insertion ... ok1286test server_fns::reports::tests::tag_filters_keep_report_dimensions_and_details_in_sync ... ok1287test server_fns::time_entries::update_tests::revoked_grant_does_not_trap_an_own_running_timer ... ok1288test server_fns::time_entries::update_tests::revoked_timer_stop_preserves_the_open_state_guard ... ok1289test server_fns::time_entries::update_tests::task_grant_revocation_committed_during_an_edit_is_rechecked ... ok1290test server_fns::users::tests::concurrency::access_changes_cannot_target_another_organization ... ok1291test server_fns::users::tests::hide_rates_clears_both_rate_fields ... ok1292test server_fns::users::tests::concurrency::concurrent_deactivations_keep_an_active_admin ... ok1293test server_fns::time_entries::update_tests::task_grants_allow_tracking_and_archived_history_for_every_role ... ok1294test server_fns::users::tests::concurrency::deactivation_and_demotion_keep_an_active_admin ... ok1295test server_fns::users::tests::concurrency::concurrent_demotions_keep_an_active_admin ... ok1296test server_fns::users::tests::concurrency::the_last_admin_cannot_be_demoted_or_deactivated ... ok1297test server_fns::users::tests::concurrency::demotion_and_deactivation_keep_an_active_admin ... ok1298test server_fns::users::tests::concurrency::unchanged_admin_access_is_allowed ... ok12991300failures:13011302---- server_fns::importers::authorization_tests::job_endpoints_enforce_session_role_and_organization stdout ----1303Request ID: 01a11672-2186-7383-b938-1a7f9b1a3bf91304Request ID: 01a11672-218a-7431-824e-d8a9309499141305Request ID: 01a11672-21ae-77d1-a529-0cebb58aeddb1306Request ID: 01a11672-21b2-7ae0-a7b1-ec5802d31a6913071308thread 'server_fns::importers::authorization_tests::job_endpoints_enforce_session_role_and_organization' (5030) panicked at crates/horae/src/server_fns/importers/authorization_tests/cli.rs:75:13:1309assertion `left == right` failed: ["import", "harvest-csv", "/build/.tmpKZFHdJ/source.csv", "--dry-run"]: {"error":{"category":"indeterminate_submission","message":"Submission acknowledgement unavailable; resubmit identical input with the same request ID"},"operation":"import.harvest-csv","outcome":"error","request_id":"01a11672-21b2-7ae0-a7b1-ec5802d31a69","version":1}1310 left: 61311 right: 1131213131314failures:1315 server_fns::importers::authorization_tests::job_endpoints_enforce_session_role_and_organization13161317test result: FAILED. 892 passed; 1 failed; 11 ignored; 0 measured; 0 filtered out; finished in 157.40s13181319error: test failed, to rerun pass `-p horae --bin horae`