nixbot

builds

numtide/horae build #225 failed

branch refactor/person-profile-commands · PR #244 · commit a0b3ee4e64 · · took 2h 43m · eval 24s

2 failed
failed attributes
status attribute duration
failed checks.aarch64-linux.e2e 1h 4m
vm-test-run-horae-e2e: !!! File "<string>", line 8, in <module> !!! retry(lambda _: "connecting to host..." in server.get_console_log(), timeout_seconds=9 …
vm-test-run-horae-e2e:
!!!   File "<string>", line 8, in <module>
!!!     retry(lambda _: "connecting to host..." in server.get_console_log(), timeout_seconds=900)
!!! 
!!! RequestedAssertionFailed: action timed out after 900.09 seconds (timeout=900)
cleanup
kill QemuMachine (pid 12)
server # qemu-system-aarch64: terminating on signal 15 from pid 6 (/nix/store/smwd56pl54f0pcjdspgh5vnf20c8xwsc-python3-3.13.13/bin/python3.13)
(finished: cleanup, in 0.11 seconds)
failed checks.aarch64-linux.tests 39m 51s
horae-tests-0.1.0: thread 'server_fns::importers::authorization_tests::job_endpoints_enforce_session_role_and_organization' (5030) panicked at crates/horae/src/ …
horae-tests-0.1.0:
thread 'server_fns::importers::authorization_tests::job_endpoints_enforce_session_role_and_organization' (5030) panicked at crates/horae/src/server_fns/importers/authorization_tests/cli.rs:75:13:
assertion `left == right` failed: ["import", "harvest-csv", "/build/.tmpKZFHdJ/source.csv", "--dry-run"]: {"error":{"category":"indeterminate_submission","message":"Submission acknowledgement unavailable; resubmit identical input with the same request ID"},"operation":"import.harvest-csv","outcome":"error","request_id":"01a11672-21b2-7ae0-a7b1-ec5802d31a69","version":1}
  left: 6
 right: 1
failures:
    server_fns::importers::authorization_tests::job_endpoints_enforce_session_role_and_organization
test result: FAILED. 892 passed; 1 failed; 11 ignored; 0 measured; 0 filtered out; finished in 157.40s
error: test failed, to rerun pass `-p horae --bin horae`
14 succeeded
succeeded attributes
status attribute duration
loading…
4 already built
skipped attributes
status attribute duration
loading…