nixbot

builds

numtide/horae build #2 failed

branch gh-readonly-queue/master/pr-216-386cb5866d568b956a878560ffb2e27ff076d948 · commit 02f7b58acd · · took 3h 7m · eval 43s

eval warnings 1 kind · 6 occurrences
  • warn Nixpkgs 26.05 will be the last release to support x86_64-darwin; see https://nixos.org/… ×6

5 failed
failed attributes
status attribute duration
failed checks.aarch64-darwin.e2e 2h 31m
setup: /nix/store/ybfiby0gg65rfvvf5vjm3ms56ffgkjmm-xauth-1.1.5 /nix/store/qc2fffcvv72hn8bmpgzmmn86fwhm5l7j-xwininfo-1.1.6 /nix/store/1fz35shpf3108k1ag5xvh …
setup:
  /nix/store/ybfiby0gg65rfvvf5vjm3ms56ffgkjmm-xauth-1.1.5
  /nix/store/qc2fffcvv72hn8bmpgzmmn86fwhm5l7j-xwininfo-1.1.6
  /nix/store/1fz35shpf3108k1ag5xvhc0jkhgff96k-xxhash-0.8.3
  /nix/store/9c3z9s01xni7nq5n7sfmraiankix9333-xz-5.8.3-doc
  /nix/store/d9bphjf71nhxxdbycqhv5kxdccfb4syk-xz-5.8.3-man
  /nix/store/mbf4llzyvlhd7mj7wa38p55qw4bxxxzp-zstd-1.5.7-man
Failed to find a machine for remote build!
derivation: 559ii28f9scq3fmgj88kjg36dg228fn6-vm-test-run-horae-e2e.drv
required (system, features): (aarch64-darwin, [apple-virt, nixos-test])
12 available machines:
(systems, maxjobs, supportedFeatures, mandatoryFeatures)
([aarch64-darwin], 8, [big-parallel, kvm, nixos-test, uid-range], [])
([aarch64-darwin], 8, [big-parallel, kvm, nixos-test, uid-range], [])
([aarch64-darwin], 8, [big-parallel, kvm, nixos-test, uid-range], [])
([aarch64-darwin], 8, [big-parallel, kvm, nixos-test, uid-range], [])
([aarch64-linux], 8, [big-parallel, kvm, nixos-test, uid-range], [])
([aarch64-linux], 8, [big-parallel…
error: Cannot build '/nix/store/559ii28f9scq3fmgj88kjg36dg228fn6-vm-test-run-horae-e2e.drv'.
       Reason: platform mismatch
       Required system: 'aarch64-darwin'
       Current system: 'x86_64-linux'
       Reason: missing system features
       Required features: {apple-virt, nixos-test}
       Available features: {benchmark, big-parallel, ca-derivations, kvm, nixos-test, recursive-nix, uid-range}
failed checks.aarch64-darwin.e2e-oidc 2h 5m
setup: /nix/store/qc2fffcvv72hn8bmpgzmmn86fwhm5l7j-xwininfo-1.1.6 /nix/store/1fz35shpf3108k1ag5xvhc0jkhgff96k-xxhash-0.8.3 /nix/store/9c3z9s01xni7nq5n7sfm …
setup:
  /nix/store/qc2fffcvv72hn8bmpgzmmn86fwhm5l7j-xwininfo-1.1.6
  /nix/store/1fz35shpf3108k1ag5xvhc0jkhgff96k-xxhash-0.8.3
  /nix/store/9c3z9s01xni7nq5n7sfmraiankix9333-xz-5.8.3-doc
  /nix/store/d9bphjf71nhxxdbycqhv5kxdccfb4syk-xz-5.8.3-man
  /nix/store/mbf4llzyvlhd7mj7wa38p55qw4bxxxzp-zstd-1.5.7-man
20yrrixpw3f38mhgnjaal7i74nyyqwk4-system-path.drv: elastic-arm-c9d8954b: not scheduled here: 20yrrixpw3f38mhgnjaal7i74nyyqwk4-system-path.drv, asking the scheduler again
Failed to find a machine for remote build!
derivation: 1qcj1lpsdlzkjk1pzcabl213j0kpvsw9-vm-test-run-horae-e2e-oidc.drv
required (system, features): (aarch64-darwin, [apple-virt, nixos-test])
12 available machines:
(systems, maxjobs, supportedFeatures, mandatoryFeatures)
([aarch64-darwin], 8, [big-parallel, kvm, nixos-test, uid-range], [])
([aarch64-darwin], 8, [big-parallel, kvm, nixos-test, uid-range], [])
([aarch64-darwin], 8, [big-parallel, kvm, nixos-test, uid-range], [])
([aarch64-darwin], 8, [big-parallel, kvm, nixos-test, uid-range], [])
([aarch64-linux], 8, [big-parallel, kvm, nixos-test, uid-range], [])
([aarch64-linux], 8, [big-par…
error: Cannot build '/nix/store/1qcj1lpsdlzkjk1pzcabl213j0kpvsw9-vm-test-run-horae-e2e-oidc.drv'.
       Reason: platform mismatch
       Required system: 'aarch64-darwin'
       Current system: 'x86_64-linux'
       Reason: missing system features
       Required features: {apple-virt, nixos-test}
       Available features: {benchmark, big-parallel, ca-derivations, kvm, nixos-test, recursive-nix, uid-range}
failed checks.aarch64-darwin.tests 21m 23s
horae-tests-0.1.0: called `Result::unwrap()` on an `Err` value: error communicating with database: Socket is not connected (os error 57) Caused by: Socket i …
horae-tests-0.1.0:
called `Result::unwrap()` on an `Err` value: error communicating with database: Socket is not connected (os error 57)
Caused by:
    Socket is not connected (os error 57)
failures:
    importers::harvest::credentials::tests::completed_credential_changes_allow_immediate_retries
    importers::harvest::engine_tests::completed_imports_allow_immediate_retries
test result: FAILED. 817 passed; 2 failed; 10 ignored; 0 measured; 0 filtered out; finished in 88.27s
error: test failed, to rerun pass `-p horae --bin horae`
failed checks.aarch64-linux.e2e 13m 13s
vm-test-run-horae-e2e: ) ^ File "/nix/store/yv2q67grjgrymd498bgdfzlhyaj04cqv-nixos-test-driver-1.1/lib/python3.13/site-packages/test_driver/machine/__ …
vm-test-run-horae-e2e:
    )
    ^
  File "/nix/store/yv2q67grjgrymd498bgdfzlhyaj04cqv-nixos-test-driver-1.1/lib/python3.13/site-packages/test_driver/machine/__init__.py", line 878, in _execute
    self.connect()
    ~~~~~~~~~~~~^^
  File "/nix/store/yv2q67grjgrymd498bgdfzlhyaj04cqv-nixos-test-driver-1.1/lib/python3.13/site-packages/test_driver/machine/__init__.py", line 1057, in connect
    raise RuntimeError("Shell did not start in time")
RuntimeError: Shell did not start in time
failed checks.aarch64-linux.e2e-oidc 13m 15s
vm-test-run-horae-e2e-oidc: ) ^ File "/nix/store/yv2q67grjgrymd498bgdfzlhyaj04cqv-nixos-test-driver-1.1/lib/python3.13/site-packages/test_driver/machi …
vm-test-run-horae-e2e-oidc:
    )
    ^
  File "/nix/store/yv2q67grjgrymd498bgdfzlhyaj04cqv-nixos-test-driver-1.1/lib/python3.13/site-packages/test_driver/machine/__init__.py", line 878, in _execute
    self.connect()
    ~~~~~~~~~~~~^^
  File "/nix/store/yv2q67grjgrymd498bgdfzlhyaj04cqv-nixos-test-driver-1.1/lib/python3.13/site-packages/test_driver/machine/__init__.py", line 1057, in connect
    raise RuntimeError("Shell did not start in time")
RuntimeError: Shell did not start in time
23 succeeded
succeeded attributes
status attribute duration
loading…
1 already built
skipped attributes
status attribute duration
loading…