nixbot

builds

numtide/horae build #1 failed

branch master · commit 386cb5866d · · took 34m 20s · eval 48s

eval warnings 1 kind · 6 occurrences
  • warn Nixpkgs 26.05 will be the last release to support x86_64-darwin; see https://nixos.org/… ×6

12 failed
failed attributes
status attribute duration
dependency failed checks.aarch64-darwin.e2e —
dependency failed checks.aarch64-darwin.e2e-oidc —
failed checks.aarch64-darwin.pkgs-formatter 3m 12s
statix-0.5.8-unstable-2026-06-28: Stopped on the first failure. Run `cargo insta test` to run all snapshots. thread 'manual_inherit_from_d185f6bcc057384cb2f1ae3 …
statix-0.5.8-unstable-2026-06-28:
Stopped on the first failure. Run `cargo insta test` to run all snapshots.
thread 'manual_inherit_from_d185f6bcc057384cb2f1ae3abb567fd1_fix' (84412615) panicked at /nix/var/nix/builds/nix-91351-3974153652/statix-0.5.8-unstable-2026-06-28-vendor/source-registry-0/insta-1.48.0/src/runtime.rs:719:13:
snapshot assertion for 'd185f6bcc057384cb2f1ae3abb567fd1_fix' failed in line 5
note: run with `RUST_BACKTRACE=1` environment variable to display a backtrace
failures:
    manual_inherit_from_d185f6bcc057384cb2f1ae3abb567fd1_fix
test result: FAILED. 7 passed; 1 failed; 0 ignored; 0 measured; 0 filtered out; finished in 0.44s
error: test failed, to rerun pass `-p statix --test manual_inherit_from`
failed checks.aarch64-darwin.tests 22m 8s
horae-tests-0.1.0: called `Result::unwrap()` on an `Err` value: error communicating with database: Socket is not connected (os error 57) Caused by: Socket i …
horae-tests-0.1.0:
called `Result::unwrap()` on an `Err` value: error communicating with database: Socket is not connected (os error 57)
Caused by:
    Socket is not connected (os error 57)
note: run with `RUST_BACKTRACE=1` environment variable to display a backtrace
failures:
    importers::harvest::engine_tests::completed_imports_allow_immediate_retries
test result: FAILED. 778 passed; 1 failed; 10 ignored; 0 measured; 0 filtered out; finished in 87.04s
error: test failed, to rerun pass `-p horae --bin horae`
dependency failed checks.aarch64-darwin.treefmt —
dependency failed checks.aarch64-linux.browser —
failed checks.aarch64-linux.devshell-default 7m 32s
… and 1 more failed derivation
… and 1 more failed derivation
dependency failed checks.aarch64-linux.e2e —
dependency failed checks.aarch64-linux.e2e-oidc —
failed checks.aarch64-linux.pkgs-default 7m 30s
… and 1 more failed derivation
… and 1 more failed derivation
failed checks.aarch64-linux.pkgs-formatter 4m 39s
… and 1 more failed derivation
… and 1 more failed derivation
dependency failed checks.aarch64-linux.treefmt —
17 succeeded
succeeded attributes
status attribute duration
loading…