numtide/horae build #13 failed ← #12 #14 →
eval warnings
1 kind
· 6 occurrences
- warn Nixpkgs 26.05 will be the last release to support x86_64-darwin; see https://nixos.org/… ×6
7 failed
| status | attribute | duration |
|---|---|---|
checks.aarch64-darwin.e2e
|
— | |
checks.aarch64-darwin.e2e-oidc
|
— | |
checks.aarch64-darwin.tests
|
45m 1s | |
horae-tests-0.1.0: called `Result::unwrap()` on an `Err` value: error communicating with database: Socket is not connected (os error 57) Caused by: Socket i …horae-tests-0.1.0:
called `Result::unwrap()` on an `Err` value: error communicating with database: Socket is not connected (os error 57)
Caused by:
Socket is not connected (os error 57)
failures:
importers::harvest::credentials::tests::completed_credential_changes_allow_immediate_retries
importers::harvest::engine_tests::completed_imports_allow_immediate_retries
test result: FAILED. 822 passed; 2 failed; 10 ignored; 0 measured; 0 filtered out; finished in 86.04s
error: test failed, to rerun pass `-p horae --bin horae`
|
||
checks.aarch64-linux.browser
|
— | |
checks.aarch64-linux.e2e
|
— | |
checks.aarch64-linux.e2e-oidc
|
— | |
checks.aarch64-linux.pkgs-default
|
28m 26s | |
horae-0.1.0: 434.22s INFO Compiled [1074/485]: rust_xlsxwriter 465.72s INFO Compiled [1075/485]: wasmtime 501.80s INFO Compiled [1076/485]: extism 1691.32s …horae-0.1.0:
434.22s INFO Compiled [1074/485]: rust_xlsxwriter
465.72s INFO Compiled [1075/485]: wasmtime
501.80s INFO Compiled [1076/485]: extism
1691.32s WARN error: could not compile `horae` (bin "horae")
1691.32s WARN Caused by:
1691.32s WARN process didn't exit successfully: `/nix/store/1d72hhpb6hy3fwc4pm9zviyavwg2ig49-cargo-auditable-0.7.2/bin/cargo-auditable rustc --crate-name horae --edition=2024 crates/horae/src/main.rs --error-format=json --json=diagnostic-rendered-ansi,artifacts,future-incompat --crate-type bin --emit=dep-info,link -C opt-level=3 -C lto -C codegen-units=1 --cfg 'feature="server"' --check-cfg 'cfg(docsrs,test)' --check-cfg 'cfg(feature, values("default", "server", "web"))' -C metadata=99221614e9466b1a -C extra-filename=-aaff9b358183ec37 --out-dir /build/source/target/aarch64-unknown-linux-gnu/server-release/deps --target aarch64-unknown-lin…
ERROR dx build: cargo build finished with errors for target: horae [aarch64-unknown-linux-gnu]
|
||
16 succeeded
| status | attribute | duration |
|---|---|---|
| loading… | ||
6 already built
| status | attribute | duration |
|---|---|---|
| loading… | ||