nixbot

builds

numtide/horae build #12 failed

branch refactor/permission-domain-foundation · PR #222 · commit e9695fda22 · · took 3h 23m · eval 19s

eval warnings 1 kind · 6 occurrences
  • warn Nixpkgs 26.05 will be the last release to support x86_64-darwin; see https://nixos.org/… ×6

5 failed
failed attributes
status attribute duration
failed checks.aarch64-darwin.e2e 1h 33m
setup: /nix/store/xnzsldq2rmsl5c7hhvj546yh7cbssjzh-closure-info.drv /nix/store/6pzw7lfd9z0kyin13n5p6jgin4g4r3dg-run-nixos-vm.drv /nix/store/qzdvqx51r770fk …
setup:
  /nix/store/xnzsldq2rmsl5c7hhvj546yh7cbssjzh-closure-info.drv
  /nix/store/6pzw7lfd9z0kyin13n5p6jgin4g4r3dg-run-nixos-vm.drv
  /nix/store/qzdvqx51r770fkzi5xa3j2jjzwzfrav7-nixos-vm.drv
  /nix/store/ymkp0j10vs1zc4jw5f1ya47c03f89i2i-driverConfiguration.json.drv
  /nix/store/p7v8b5ys4rfkyzznvay0pbwgvzyc67l1-nixos-test-driver-horae-e2e.drv
  /nix/store/8szp94zq24krqa6fiqagddwqlhzdyz1m-vm-test-run-horae-e2e.drv
Failed to find a machine for remote build!
derivation: 8szp94zq24krqa6fiqagddwqlhzdyz1m-vm-test-run-horae-e2e.drv
required (system, features): (aarch64-darwin, [apple-virt, nixos-test])
12 available machines:
(systems, maxjobs, supportedFeatures, mandatoryFeatures)
([aarch64-darwin], 8, [big-parallel, kvm, nixos-test, uid-range], [])
([aarch64-darwin], 8, [big-parallel, kvm, nixos-test, uid-range], [])
([aarch64-darwin], 8, [big-parallel, kvm, nixos-test, uid-range], [])
([aarch64-darwin], 8, [big-parallel, kvm, nixos-test, uid-range], [])
([aarch64-linux], 8, [big-parallel, kvm, nixos-test, uid-range], [])
([aarch64-linux], 8, [big-parallel…
error: Cannot build '/nix/store/8szp94zq24krqa6fiqagddwqlhzdyz1m-vm-test-run-horae-e2e.drv'.
       Reason: platform mismatch
       Required system: 'aarch64-darwin'
       Current system: 'x86_64-linux'
       Reason: missing system features
       Required features: {apple-virt, nixos-test}
       Available features: {benchmark, big-parallel, ca-derivations, kvm, nixos-test, recursive-nix, uid-range}
failed checks.aarch64-darwin.e2e-oidc 1h 30m
setup: /nix/store/yykal63zsifvfrbyy6xpaqji9vci1ddy-closure-info.drv /nix/store/39fxn40mphipdcg2v1h11fjxkxplvdy2-run-nixos-vm.drv /nix/store/9894msawk8jbl1 …
setup:
  /nix/store/yykal63zsifvfrbyy6xpaqji9vci1ddy-closure-info.drv
  /nix/store/39fxn40mphipdcg2v1h11fjxkxplvdy2-run-nixos-vm.drv
  /nix/store/9894msawk8jbl1rdlvf91hi0gdnlmz8s-nixos-vm.drv
  /nix/store/5g775kl5f92yajv3y3d66m3hpr7bm935-driverConfiguration.json.drv
  /nix/store/z6dci8pbi6xk39n026wnyy7mdnxm2pv2-nixos-test-driver-horae-e2e-oidc.drv
  /nix/store/60fpcq5v1l2w1jyb4b7x6ps9x18wqrjc-vm-test-run-horae-e2e-oidc.drv
Failed to find a machine for remote build!
derivation: 60fpcq5v1l2w1jyb4b7x6ps9x18wqrjc-vm-test-run-horae-e2e-oidc.drv
required (system, features): (aarch64-darwin, [apple-virt, nixos-test])
12 available machines:
(systems, maxjobs, supportedFeatures, mandatoryFeatures)
([aarch64-darwin], 8, [big-parallel, kvm, nixos-test, uid-range], [])
([aarch64-darwin], 8, [big-parallel, kvm, nixos-test, uid-range], [])
([aarch64-darwin], 8, [big-parallel, kvm, nixos-test, uid-range], [])
([aarch64-darwin], 8, [big-parallel, kvm, nixos-test, uid-range], [])
([aarch64-linux], 8, [big-parallel, kvm, nixos-test, uid-range], [])
([aarch64-linux], 8, [big-par…
error: Cannot build '/nix/store/60fpcq5v1l2w1jyb4b7x6ps9x18wqrjc-vm-test-run-horae-e2e-oidc.drv'.
       Reason: platform mismatch
       Required system: 'aarch64-darwin'
       Current system: 'x86_64-linux'
       Reason: missing system features
       Required features: {apple-virt, nixos-test}
       Available features: {benchmark, big-parallel, ca-derivations, kvm, nixos-test, recursive-nix, uid-range}
failed checks.aarch64-darwin.tests 46m 53s
horae-tests-0.1.0: called `Result::unwrap()` on an `Err` value: error communicating with database: Socket is not connected (os error 57) Caused by: Socket i …
horae-tests-0.1.0:
called `Result::unwrap()` on an `Err` value: error communicating with database: Socket is not connected (os error 57)
Caused by:
    Socket is not connected (os error 57)
failures:
    importers::harvest::credentials::tests::completed_credential_changes_allow_immediate_retries
    importers::harvest::engine_tests::lookup_cache::repeated_rows_resolve_each_user_and_project_task_once
test result: FAILED. 828 passed; 2 failed; 10 ignored; 0 measured; 0 filtered out; finished in 82.42s
error: test failed, to rerun pass `-p horae --bin horae`
failed checks.aarch64-linux.e2e 9m 16s
vm-test-run-horae-e2e: ) ^ File "/nix/store/yv2q67grjgrymd498bgdfzlhyaj04cqv-nixos-test-driver-1.1/lib/python3.13/site-packages/test_driver/machine/__ …
vm-test-run-horae-e2e:
    )
    ^
  File "/nix/store/yv2q67grjgrymd498bgdfzlhyaj04cqv-nixos-test-driver-1.1/lib/python3.13/site-packages/test_driver/machine/__init__.py", line 878, in _execute
    self.connect()
    ~~~~~~~~~~~~^^
  File "/nix/store/yv2q67grjgrymd498bgdfzlhyaj04cqv-nixos-test-driver-1.1/lib/python3.13/site-packages/test_driver/machine/__init__.py", line 1057, in connect
    raise RuntimeError("Shell did not start in time")
RuntimeError: Shell did not start in time
failed checks.aarch64-linux.e2e-oidc 9m 17s
vm-test-run-horae-e2e-oidc: ) ^ File "/nix/store/yv2q67grjgrymd498bgdfzlhyaj04cqv-nixos-test-driver-1.1/lib/python3.13/site-packages/test_driver/machi …
vm-test-run-horae-e2e-oidc:
    )
    ^
  File "/nix/store/yv2q67grjgrymd498bgdfzlhyaj04cqv-nixos-test-driver-1.1/lib/python3.13/site-packages/test_driver/machine/__init__.py", line 878, in _execute
    self.connect()
    ~~~~~~~~~~~~^^
  File "/nix/store/yv2q67grjgrymd498bgdfzlhyaj04cqv-nixos-test-driver-1.1/lib/python3.13/site-packages/test_driver/machine/__init__.py", line 1057, in connect
    raise RuntimeError("Shell did not start in time")
RuntimeError: Shell did not start in time
18 succeeded
succeeded attributes
status attribute duration
loading…
6 already built
skipped attributes
status attribute duration
loading…