setup
checks.aarch64-darwin.tests
· build #12
· raw
1these 2 derivations will be built:2 /nix/store/74yhrmh53igp4830n167h3hfdibk41kk-cargo-vendor-dir.drv3 /nix/store/36w6spzfkfi8dwfq6apfbrif1xbj1dah-horae-tests-0.1.0.drv4error: build of '/nix/store/36w6spzfkfi8dwfq6apfbrif1xbj1dah-horae-tests-0.1.0.drv' on 'grpc://farm.numtide.com:50051?client-cert=/run/secrets/vars/per-machine/bld1/nix-farm-ci/crt&client-key=/run/secrets/vars/per-machine/bld1/nix-farm-ci/key&connect-timeout=23&system=aarch64-darwin' failed: Cannot build '/nix/store/36w6spzfkfi8dwfq6apfbrif1xbj1dah-horae-tests-0.1.0.drv'.5 Reason: builder failed with exit code 101.6 Output paths:7 /nix/store/zy5gqkgszq674rw2vx4lrbfczyfih9sg-horae-tests-0.1.08 Last 25 log lines:9 > thread 'importers::harvest::credentials::tests::completed_credential_changes_allow_immediate_retries' (87474870) panicked at crates/horae/src/importers/harvest/credentials.rs:484:42:10 > called `Result::unwrap()` on an `Err` value: Other(error communicating with database: Socket is not connected (os error 57)11 >12 > Caused by:13 > Socket is not connected (os error 57))14 > note: run with `RUST_BACKTRACE=1` environment variable to display a backtrace15 >16 > ---- importers::harvest::engine_tests::lookup_cache::repeated_rows_resolve_each_user_and_project_task_once stdout ----17 > Csv name_only=false DryRun created=100: QueryCounts { total: 412, users: 1, links: 1, releases: 100, rollbacks: 0 }18 > Csv name_only=false Commit created=100: QueryCounts { total: 412, users: 1, links: 1, releases: 100, rollbacks: 0 }19 >20 > thread 'importers::harvest::engine_tests::lookup_cache::repeated_rows_resolve_each_user_and_project_task_once' (87476055) panicked at crates/horae/src/importers/harvest/engine_tests/lookup_cache.rs:86:10:21 > called `Result::unwrap()` on an `Err` value: error communicating with database: Socket is not connected (os error 57)22 >23 > Caused by:24 > Socket is not connected (os error 57)25 >26 >27 > failures:28 > importers::harvest::credentials::tests::completed_credential_changes_allow_immediate_retries29 > importers::harvest::engine_tests::lookup_cache::repeated_rows_resolve_each_user_and_project_task_once30 >31 > test result: FAILED. 828 passed; 2 failed; 10 ignored; 0 measured; 0 filtered out; finished in 82.42s32 >33 > error: test failed, to rerun pass `-p horae --bin horae`34 For full logs, run:35 nix log /nix/store/36w6spzfkfi8dwfq6apfbrif1xbj1dah-horae-tests-0.1.0.drv36error: Cannot build '/nix/store/36w6spzfkfi8dwfq6apfbrif1xbj1dah-horae-tests-0.1.0.drv'.37 Reason: builder failed with exit code 1.38 Output paths:39 /nix/store/zy5gqkgszq674rw2vx4lrbfczyfih9sg-horae-tests-0.1.0