nixbot

builds

numtide/llm-agents.nix build #9148 failed

branch main · PR #11423 · commit fbe7902457 · · took 7m 31s · eval 9s

eval warnings 1 kind · 1 occurrence
  • warn setting 'accept-flake-config' is ignored: iets never applies a flake's nixConfig, so a flake that sets extra-substituters or allow-import-from-derivation there runs without them; put the settings in nix.conf ×1

3 failed
failed attributes
status attribute duration
failed checks.aarch64-darwin.pkgs-agent-deck 5m 51s
agent-deck-1.16.34: Full reference: https://github.com/asheshgoplani/agent-deck#watchers No routing rules configured. No watchers configured. Run 'agent-deck wa …
agent-deck-1.16.34:
Full reference: https://github.com/asheshgoplani/agent-deck#watchers
No routing rules configured.
No watchers configured.
Run 'agent-deck watcher create <type> --name <name>' to create one.
Installed skill: watcher-creator -> /private/tmp/nix-XTzxFz/TestXDGTask6_WatcherInstallSkillUsesConfiguredPoolPath1924111927/001/xdg-config/agent-deck/skills/pool/watcher-creator
FAIL
FAIL	github.com/asheshgoplani/agent-deck/cmd/agent-deck	273.317s
FAIL
failed checks.aarch64-linux.pkgs-agent-deck 7m 19s
agent-deck-1.16.34: fanout_hint_docs_test.go:119: launch-subagent.sh [Worker Do the task.]: exit status 1 --- FAIL: TestLaunchSubagentScript_Appends …
agent-deck-1.16.34:
        fanout_hint_docs_test.go:119: launch-subagent.sh [Worker Do the task.]: exit status 1
    --- FAIL: TestLaunchSubagentScript_AppendsFanoutHintOnlyWithoutIdentityBlock/no_identity_block (0.01s)
        fanout_hint_docs_test.go:119: launch-subagent.sh [Worker Do the task.]: exit status 1
--- FAIL: TestAskSecretRefusesExistingNameWithoutReplace (60.08s)
    ask_cmd_test.go:511: run [ask secret conductor/GH_TOKEN --session 0e9c2759-1793050782]: still running after 1m0s
FAIL
FAIL	github.com/asheshgoplani/agent-deck/cmd/agent-deck	304.671s
FAIL
failed checks.x86_64-linux.pkgs-agent-deck 6m 33s
setup: don't know how to build these paths: /nix/store/43dxczbxwsjwzrkfv4y8z5kf6hxbb2lk-check-agent-deck.drv warning: ignoring the client-specified setting 's …
setup:
don't know how to build these paths:
  /nix/store/43dxczbxwsjwzrkfv4y8z5kf6hxbb2lk-check-agent-deck.drv
warning: ignoring the client-specified setting 'store', because it is a restricted setting and you are not a trusted user
error: dependency '3wczna2dmjyrxypxdmyi872mpj8zv45g-agent-deck-1.16.34.drv' failed
13 succeeded
succeeded attributes
status attribute duration
loading…
682 already built
skipped attributes
status attribute duration
loading…