nixbot

builds

failed mcptoon-0.8.30 checks.aarch64-linux.pkgs-mcptoon · build #9087 · raw

1elastic-arm-c3833f78: building mb06rqh7002z0bzl9h77s9lm1vlh8yql-mcptoon-0.8.30.drv2Sourcing python-remove-tests-dir-hook3Sourcing python-catch-conflicts-hook.sh4Sourcing python-remove-bin-bytecode-hook.sh5Sourcing pypa-build-hook6Using pypaBuildPhase7Sourcing python-runtime-deps-check-hook8Using pythonRuntimeDepsCheckHook9Sourcing pypa-install-hook10Using pypaInstallPhase11Sourcing python-imports-check-hook.sh12Using pythonImportsCheckPhase13Sourcing python-namespaces-hook14Sourcing python-catch-conflicts-hook.sh15Sourcing pytest-check-hook16Using pytestCheckPhase
unpackPhase
17unpacking source archive /nix/store/iwkbw28ihvlyxf5f6mqhv98c20panz8c-source18source root is source19setting SOURCE_DATE_EPOCH to timestamp 315619200 of file "source/uv.lock"
configurePhase
20no configure script, doing nothing
buildPhase
21Executing pypaBuildPhase22Creating a wheel...23pypa build flags: --no-isolation --outdir dist/ --wheel24* Getting build dependencies for wheel...25/nix/store/isv6zwb5wfnn6sb1w1skg3cvlq83mh3n-python3.14-setuptools-83.0.0/lib/python3.14/site-packages/setuptools/config/_apply_pyprojecttoml.py:82: SetuptoolsDeprecationWarning: `project.license` as a TOML table is deprecated26!!2728 ********************************************************************************29 Please use a simple string containing a SPDX expression for `project.license`. You can also use `project.license-files`. (Both options available on setuptools>=77.0.0).3031 By 2027-Feb-18, you need to update your project and remove deprecated calls32 or your builds will no longer be supported.3334 See https://packaging.python.org/en/latest/guides/writing-pyproject-toml/#license for details.35 ********************************************************************************3637!!38 corresp(dist, value, root_dir)39/nix/store/isv6zwb5wfnn6sb1w1skg3cvlq83mh3n-python3.14-setuptools-83.0.0/lib/python3.14/site-packages/setuptools/config/_apply_pyprojecttoml.py:61: SetuptoolsDeprecationWarning: License classifiers are deprecated.40!!4142 ********************************************************************************43 Please consider removing the following classifiers in favor of a SPDX license expression:4445 License :: OSI Approved :: Apache Software License4647 See https://packaging.python.org/en/latest/guides/writing-pyproject-toml/#license for details.48 ********************************************************************************4950!!51 dist._finalize_license_expression()52/nix/store/isv6zwb5wfnn6sb1w1skg3cvlq83mh3n-python3.14-setuptools-83.0.0/lib/python3.14/site-packages/setuptools/dist.py:765: SetuptoolsDeprecationWarning: License classifiers are deprecated.53!!5455 ********************************************************************************56 Please consider removing the following classifiers in favor of a SPDX license expression:5758 License :: OSI Approved :: Apache Software License5960 See https://packaging.python.org/en/latest/guides/writing-pyproject-toml/#license for details.61 ********************************************************************************6263!!64 self._finalize_license_expression()65running egg_info66creating src/mcptoon.egg-info67writing src/mcptoon.egg-info/PKG-INFO68writing dependency_links to src/mcptoon.egg-info/dependency_links.txt69writing entry points to src/mcptoon.egg-info/entry_points.txt70writing requirements to src/mcptoon.egg-info/requires.txt71writing top-level names to src/mcptoon.egg-info/top_level.txt72writing manifest file 'src/mcptoon.egg-info/SOURCES.txt'73reading manifest file 'src/mcptoon.egg-info/SOURCES.txt'74adding license file 'LICENSE'75adding license file 'NOTICE'76writing manifest file 'src/mcptoon.egg-info/SOURCES.txt'77* Building wheel...78/nix/store/isv6zwb5wfnn6sb1w1skg3cvlq83mh3n-python3.14-setuptools-83.0.0/lib/python3.14/site-packages/setuptools/config/_apply_pyprojecttoml.py:82: SetuptoolsDeprecationWarning: `project.license` as a TOML table is deprecated79!!8081 ********************************************************************************82 Please use a simple string containing a SPDX expression for `project.license`. You can also use `project.license-files`. (Both options available on setuptools>=77.0.0).8384 By 2027-Feb-18, you need to update your project and remove deprecated calls85 or your builds will no longer be supported.8687 See https://packaging.python.org/en/latest/guides/writing-pyproject-toml/#license for details.88 ********************************************************************************8990!!91 corresp(dist, value, root_dir)92/nix/store/isv6zwb5wfnn6sb1w1skg3cvlq83mh3n-python3.14-setuptools-83.0.0/lib/python3.14/site-packages/setuptools/config/_apply_pyprojecttoml.py:61: SetuptoolsDeprecationWarning: License classifiers are deprecated.93!!9495 ********************************************************************************96 Please consider removing the following classifiers in favor of a SPDX license expression:9798 License :: OSI Approved :: Apache Software License99100 See https://packaging.python.org/en/latest/guides/writing-pyproject-toml/#license for details.101 ********************************************************************************102103!!104 dist._finalize_license_expression()105/nix/store/isv6zwb5wfnn6sb1w1skg3cvlq83mh3n-python3.14-setuptools-83.0.0/lib/python3.14/site-packages/setuptools/dist.py:765: SetuptoolsDeprecationWarning: License classifiers are deprecated.106!!107108 ********************************************************************************109 Please consider removing the following classifiers in favor of a SPDX license expression:110111 License :: OSI Approved :: Apache Software License112113 See https://packaging.python.org/en/latest/guides/writing-pyproject-toml/#license for details.114 ********************************************************************************115116!!117 self._finalize_license_expression()118running bdist_wheel119running build120running build_py121creating build/lib/mcptoon122copying src/mcptoon/compressor.py -> build/lib/mcptoon123copying src/mcptoon/oauth.py -> build/lib/mcptoon124copying src/mcptoon/serve.py -> build/lib/mcptoon125copying src/mcptoon/floodguard.py -> build/lib/mcptoon126copying src/mcptoon/session_log.py -> build/lib/mcptoon127copying src/mcptoon/update.py -> build/lib/mcptoon128copying src/mcptoon/packs.py -> build/lib/mcptoon129copying src/mcptoon/__init__.py -> build/lib/mcptoon130copying src/mcptoon/kb.py -> build/lib/mcptoon131copying src/mcptoon/demo_server.py -> build/lib/mcptoon132copying src/mcptoon/demo.py -> build/lib/mcptoon133copying src/mcptoon/mcp_extras.py -> build/lib/mcptoon134copying src/mcptoon/upgrade.py -> build/lib/mcptoon135copying src/mcptoon/ccr.py -> build/lib/mcptoon136copying src/mcptoon/welcome.py -> build/lib/mcptoon137copying src/mcptoon/manifest.py -> build/lib/mcptoon138copying src/mcptoon/headers.py -> build/lib/mcptoon139copying src/mcptoon/report.py -> build/lib/mcptoon140copying src/mcptoon/watch.py -> build/lib/mcptoon141copying src/mcptoon/installer.py -> build/lib/mcptoon142copying src/mcptoon/__main__.py -> build/lib/mcptoon143copying src/mcptoon/schema_simplifier.py -> build/lib/mcptoon144copying src/mcptoon/client.py -> build/lib/mcptoon145copying src/mcptoon/cli.py -> build/lib/mcptoon146copying src/mcptoon/health.py -> build/lib/mcptoon147copying src/mcptoon/savings.py -> build/lib/mcptoon148copying src/mcptoon/errors.py -> build/lib/mcptoon149copying src/mcptoon/native_tools.py -> build/lib/mcptoon150copying src/mcptoon/mode.py -> build/lib/mcptoon151copying src/mcptoon/usage.py -> build/lib/mcptoon152copying src/mcptoon/skills.py -> build/lib/mcptoon153copying src/mcptoon/sync.py -> build/lib/mcptoon154copying src/mcptoon/docs.py -> build/lib/mcptoon155copying src/mcptoon/graphql.py -> build/lib/mcptoon156copying src/mcptoon/discover.py -> build/lib/mcptoon157copying src/mcptoon/bench.py -> build/lib/mcptoon158copying src/mcptoon/config.py -> build/lib/mcptoon159copying src/mcptoon/exec_sandbox.py -> build/lib/mcptoon160copying src/mcptoon/toon_vendored.py -> build/lib/mcptoon161copying src/mcptoon/openapi.py -> build/lib/mcptoon162copying src/mcptoon/router.py -> build/lib/mcptoon163copying src/mcptoon/footer.py -> build/lib/mcptoon164copying src/mcptoon/plugin.py -> build/lib/mcptoon165copying src/mcptoon/bench_tokens.py -> build/lib/mcptoon166copying src/mcptoon/bake.py -> build/lib/mcptoon167copying src/mcptoon/cache.py -> build/lib/mcptoon168copying src/mcptoon/output.py -> build/lib/mcptoon169creating build/lib/mcptoon/_toon170copying src/mcptoon/_toon/normalize.py -> build/lib/mcptoon/_toon171copying src/mcptoon/_toon/__init__.py -> build/lib/mcptoon/_toon172copying src/mcptoon/_toon/writer.py -> build/lib/mcptoon/_toon173copying src/mcptoon/_toon/constants.py -> build/lib/mcptoon/_toon174copying src/mcptoon/_toon/encoders.py -> build/lib/mcptoon/_toon175copying src/mcptoon/_toon/decoder.py -> build/lib/mcptoon/_toon176copying src/mcptoon/_toon/primitives.py -> build/lib/mcptoon/_toon177copying src/mcptoon/_toon/types.py -> build/lib/mcptoon/_toon178copying src/mcptoon/_toon/encoder.py -> build/lib/mcptoon/_toon179running egg_info180writing src/mcptoon.egg-info/PKG-INFO181writing dependency_links to src/mcptoon.egg-info/dependency_links.txt182writing entry points to src/mcptoon.egg-info/entry_points.txt183writing requirements to src/mcptoon.egg-info/requires.txt184writing top-level names to src/mcptoon.egg-info/top_level.txt185reading manifest file 'src/mcptoon.egg-info/SOURCES.txt'186adding license file 'LICENSE'187adding license file 'NOTICE'188writing manifest file 'src/mcptoon.egg-info/SOURCES.txt'189copying src/mcptoon/packs.json -> build/lib/mcptoon190creating build/lib/mcptoon/skill191copying src/mcptoon/skill/SKILL.md -> build/lib/mcptoon/skill192installing to build/bdist.linux-aarch64/wheel193running install194running install_lib195creating build/bdist.linux-aarch64/wheel196creating build/bdist.linux-aarch64/wheel/mcptoon197copying build/lib/mcptoon/compressor.py -> build/bdist.linux-aarch64/wheel/./mcptoon198copying build/lib/mcptoon/oauth.py -> build/bdist.linux-aarch64/wheel/./mcptoon199copying build/lib/mcptoon/serve.py -> build/bdist.linux-aarch64/wheel/./mcptoon200copying build/lib/mcptoon/floodguard.py -> build/bdist.linux-aarch64/wheel/./mcptoon201copying build/lib/mcptoon/session_log.py -> build/bdist.linux-aarch64/wheel/./mcptoon202copying build/lib/mcptoon/update.py -> build/bdist.linux-aarch64/wheel/./mcptoon203copying build/lib/mcptoon/packs.py -> build/bdist.linux-aarch64/wheel/./mcptoon204copying build/lib/mcptoon/__init__.py -> build/bdist.linux-aarch64/wheel/./mcptoon205copying build/lib/mcptoon/kb.py -> build/bdist.linux-aarch64/wheel/./mcptoon206copying build/lib/mcptoon/demo_server.py -> build/bdist.linux-aarch64/wheel/./mcptoon207copying build/lib/mcptoon/demo.py -> build/bdist.linux-aarch64/wheel/./mcptoon208copying build/lib/mcptoon/mcp_extras.py -> build/bdist.linux-aarch64/wheel/./mcptoon209copying build/lib/mcptoon/upgrade.py -> build/bdist.linux-aarch64/wheel/./mcptoon210copying build/lib/mcptoon/ccr.py -> build/bdist.linux-aarch64/wheel/./mcptoon211copying build/lib/mcptoon/welcome.py -> build/bdist.linux-aarch64/wheel/./mcptoon212copying build/lib/mcptoon/manifest.py -> build/bdist.linux-aarch64/wheel/./mcptoon213copying build/lib/mcptoon/packs.json -> build/bdist.linux-aarch64/wheel/./mcptoon214copying build/lib/mcptoon/headers.py -> build/bdist.linux-aarch64/wheel/./mcptoon215copying build/lib/mcptoon/report.py -> build/bdist.linux-aarch64/wheel/./mcptoon216copying build/lib/mcptoon/watch.py -> build/bdist.linux-aarch64/wheel/./mcptoon217copying build/lib/mcptoon/installer.py -> build/bdist.linux-aarch64/wheel/./mcptoon218copying build/lib/mcptoon/__main__.py -> build/bdist.linux-aarch64/wheel/./mcptoon219copying build/lib/mcptoon/schema_simplifier.py -> build/bdist.linux-aarch64/wheel/./mcptoon220copying build/lib/mcptoon/client.py -> build/bdist.linux-aarch64/wheel/./mcptoon221copying build/lib/mcptoon/cli.py -> build/bdist.linux-aarch64/wheel/./mcptoon222creating build/bdist.linux-aarch64/wheel/mcptoon/skill223copying build/lib/mcptoon/skill/SKILL.md -> build/bdist.linux-aarch64/wheel/./mcptoon/skill224copying build/lib/mcptoon/health.py -> build/bdist.linux-aarch64/wheel/./mcptoon225copying build/lib/mcptoon/savings.py -> build/bdist.linux-aarch64/wheel/./mcptoon226copying build/lib/mcptoon/errors.py -> build/bdist.linux-aarch64/wheel/./mcptoon227copying build/lib/mcptoon/native_tools.py -> build/bdist.linux-aarch64/wheel/./mcptoon228copying build/lib/mcptoon/mode.py -> build/bdist.linux-aarch64/wheel/./mcptoon229copying build/lib/mcptoon/usage.py -> build/bdist.linux-aarch64/wheel/./mcptoon230copying build/lib/mcptoon/skills.py -> build/bdist.linux-aarch64/wheel/./mcptoon231copying build/lib/mcptoon/sync.py -> build/bdist.linux-aarch64/wheel/./mcptoon232copying build/lib/mcptoon/docs.py -> build/bdist.linux-aarch64/wheel/./mcptoon233copying build/lib/mcptoon/graphql.py -> build/bdist.linux-aarch64/wheel/./mcptoon234copying build/lib/mcptoon/discover.py -> build/bdist.linux-aarch64/wheel/./mcptoon235copying build/lib/mcptoon/bench.py -> build/bdist.linux-aarch64/wheel/./mcptoon236copying build/lib/mcptoon/config.py -> build/bdist.linux-aarch64/wheel/./mcptoon237copying build/lib/mcptoon/exec_sandbox.py -> build/bdist.linux-aarch64/wheel/./mcptoon238copying build/lib/mcptoon/toon_vendored.py -> build/bdist.linux-aarch64/wheel/./mcptoon239copying build/lib/mcptoon/openapi.py -> build/bdist.linux-aarch64/wheel/./mcptoon240creating build/bdist.linux-aarch64/wheel/mcptoon/_toon241copying build/lib/mcptoon/_toon/normalize.py -> build/bdist.linux-aarch64/wheel/./mcptoon/_toon242copying build/lib/mcptoon/_toon/__init__.py -> build/bdist.linux-aarch64/wheel/./mcptoon/_toon243copying build/lib/mcptoon/_toon/writer.py -> build/bdist.linux-aarch64/wheel/./mcptoon/_toon244copying build/lib/mcptoon/_toon/constants.py -> build/bdist.linux-aarch64/wheel/./mcptoon/_toon245copying build/lib/mcptoon/_toon/encoders.py -> build/bdist.linux-aarch64/wheel/./mcptoon/_toon246copying build/lib/mcptoon/_toon/decoder.py -> build/bdist.linux-aarch64/wheel/./mcptoon/_toon247copying build/lib/mcptoon/_toon/primitives.py -> build/bdist.linux-aarch64/wheel/./mcptoon/_toon248copying build/lib/mcptoon/_toon/types.py -> build/bdist.linux-aarch64/wheel/./mcptoon/_toon249copying build/lib/mcptoon/_toon/encoder.py -> build/bdist.linux-aarch64/wheel/./mcptoon/_toon250copying build/lib/mcptoon/router.py -> build/bdist.linux-aarch64/wheel/./mcptoon251copying build/lib/mcptoon/footer.py -> build/bdist.linux-aarch64/wheel/./mcptoon252copying build/lib/mcptoon/plugin.py -> build/bdist.linux-aarch64/wheel/./mcptoon253copying build/lib/mcptoon/bench_tokens.py -> build/bdist.linux-aarch64/wheel/./mcptoon254copying build/lib/mcptoon/bake.py -> build/bdist.linux-aarch64/wheel/./mcptoon255copying build/lib/mcptoon/cache.py -> build/bdist.linux-aarch64/wheel/./mcptoon256copying build/lib/mcptoon/output.py -> build/bdist.linux-aarch64/wheel/./mcptoon257running install_egg_info258Copying src/mcptoon.egg-info to build/bdist.linux-aarch64/wheel/./mcptoon-0.8.30-py3.14.egg-info259running install_scripts260creating build/bdist.linux-aarch64/wheel/mcptoon-0.8.30.dist-info/WHEEL261creating '/build/source/dist/.tmp-d1bybalp/mcptoon-0.8.30-py3-none-any.whl' and adding 'build/bdist.linux-aarch64/wheel' to it262adding 'mcptoon/__init__.py'263adding 'mcptoon/__main__.py'264adding 'mcptoon/bake.py'265adding 'mcptoon/bench.py'266adding 'mcptoon/bench_tokens.py'267adding 'mcptoon/cache.py'268adding 'mcptoon/ccr.py'269adding 'mcptoon/cli.py'270adding 'mcptoon/client.py'271adding 'mcptoon/compressor.py'272adding 'mcptoon/config.py'273adding 'mcptoon/demo.py'274adding 'mcptoon/demo_server.py'275adding 'mcptoon/discover.py'276adding 'mcptoon/docs.py'277adding 'mcptoon/errors.py'278adding 'mcptoon/exec_sandbox.py'279adding 'mcptoon/floodguard.py'280adding 'mcptoon/footer.py'281adding 'mcptoon/graphql.py'282adding 'mcptoon/headers.py'283adding 'mcptoon/health.py'284adding 'mcptoon/installer.py'285adding 'mcptoon/kb.py'286adding 'mcptoon/manifest.py'287adding 'mcptoon/mcp_extras.py'288adding 'mcptoon/mode.py'289adding 'mcptoon/native_tools.py'290adding 'mcptoon/oauth.py'291adding 'mcptoon/openapi.py'292adding 'mcptoon/output.py'293adding 'mcptoon/packs.json'294adding 'mcptoon/packs.py'295adding 'mcptoon/plugin.py'296adding 'mcptoon/report.py'297adding 'mcptoon/router.py'298adding 'mcptoon/savings.py'299adding 'mcptoon/schema_simplifier.py'300adding 'mcptoon/serve.py'301adding 'mcptoon/session_log.py'302adding 'mcptoon/skills.py'303adding 'mcptoon/sync.py'304adding 'mcptoon/toon_vendored.py'305adding 'mcptoon/update.py'306adding 'mcptoon/upgrade.py'307adding 'mcptoon/usage.py'308adding 'mcptoon/watch.py'309adding 'mcptoon/welcome.py'310adding 'mcptoon/_toon/__init__.py'311adding 'mcptoon/_toon/constants.py'312adding 'mcptoon/_toon/decoder.py'313adding 'mcptoon/_toon/encoder.py'314adding 'mcptoon/_toon/encoders.py'315adding 'mcptoon/_toon/normalize.py'316adding 'mcptoon/_toon/primitives.py'317adding 'mcptoon/_toon/types.py'318adding 'mcptoon/_toon/writer.py'319adding 'mcptoon/skill/SKILL.md'320adding 'mcptoon-0.8.30.dist-info/licenses/LICENSE'321adding 'mcptoon-0.8.30.dist-info/licenses/NOTICE'322adding 'mcptoon-0.8.30.dist-info/METADATA'323adding 'mcptoon-0.8.30.dist-info/WHEEL'324adding 'mcptoon-0.8.30.dist-info/entry_points.txt'325adding 'mcptoon-0.8.30.dist-info/top_level.txt'326adding 'mcptoon-0.8.30.dist-info/RECORD'327removing build/bdist.linux-aarch64/wheel328Successfully built mcptoon-0.8.30-py3-none-any.whl329Finished creating a wheel...330Finished executing pypaBuildPhase
pythonRuntimeDepsCheckHook
331Executing pythonRuntimeDepsCheck332Checking runtime dependencies for mcptoon-0.8.30-py3-none-any.whl333Finished executing pythonRuntimeDepsCheck
installPhase
334Executing pypaInstallPhase335Successfully installed mcptoon-0.8.30-py3-none-any.whl336Finished executing pypaInstallPhase
pythonOutputDistPhase
337Executing pythonOutputDistPhase338Finished executing pythonOutputDistPhase
fixupPhase
339shrinking RPATHs of ELF executables and libraries in /nix/store/vgia4bcj8ac6lmvbx0ivwghm6j88g5jq-mcptoon-0.8.30340checking for references to /build/ in /nix/store/vgia4bcj8ac6lmvbx0ivwghm6j88g5jq-mcptoon-0.8.30...341patching script interpreter paths in /nix/store/vgia4bcj8ac6lmvbx0ivwghm6j88g5jq-mcptoon-0.8.30342stripping (with command strip and flags -S -p) in /nix/store/vgia4bcj8ac6lmvbx0ivwghm6j88g5jq-mcptoon-0.8.30/lib /nix/store/vgia4bcj8ac6lmvbx0ivwghm6j88g5jq-mcptoon-0.8.30/bin343shrinking RPATHs of ELF executables and libraries in /nix/store/l1319bzbjd2kik5x14vrl8ldnn29vkfn-mcptoon-0.8.30-dist344checking for references to /build/ in /nix/store/l1319bzbjd2kik5x14vrl8ldnn29vkfn-mcptoon-0.8.30-dist...345patching script interpreter paths in /nix/store/l1319bzbjd2kik5x14vrl8ldnn29vkfn-mcptoon-0.8.30-dist346Rewriting #!/nix/store/81ag9nxz1flw3xjkv1vvqg8y2ipx2ins-python3-3.14.7/bin/python3.14 to #!/nix/store/81ag9nxz1flw3xjkv1vvqg8y2ipx2ins-python3-3.14.7347wrapping `/nix/store/vgia4bcj8ac6lmvbx0ivwghm6j88g5jq-mcptoon-0.8.30/bin/mcptoon'...348Executing pythonRemoveTestsDir349Finished executing pythonRemoveTestsDir
installCheckPhase
350no Makefile or custom installCheckPhase, doing nothing
pythonImportsCheckPhase
351Executing pythonImportsCheckPhase352Check whether the following modules can be imported: mcptoon
pytestCheckPhase
353Executing pytestCheckPhase354pytest flags: -m pytest -k not\ \(test_search_registry_returns_list\)\ and\ not\ \(test_search_smithery_returns_list\)\ and\ not\ \(test_search_mcp_registry_returns_list\)\ and\ not\ \(test_packaged_path_resolves_to_the_copy_on_disk\)\ and\ not\ \(test_the_node_warning_is_not_the_headline\)\ and\ not\ \(test_process_died_includes_stderr\)\ and\ not\ \(test_a_module_without_main_is_not_runnable\)\ and\ not\ \(test_changelog_has_unreleased_delivery_mode\)355============================= test session starts ==============================356platform linux -- Python 3.14.7, pytest-9.1.1, pluggy-1.6.0357rootdir: /build/source358configfile: pyproject.toml359testpaths: tests360collected 3012 items / 7 deselected / 3005 selected 361362tests/test_activity_presence.py ................................... [ 1%]363tests/test_add_url_validation.py .................. [ 1%]364tests/test_bench.py .............. [ 2%]365tests/test_bench_tokens.py ....ss.. [ 2%]366tests/test_benchmark_repro.py sss........... [ 2%]367tests/test_cache.py ........ [ 3%]368tests/test_calculator.py .......................... [ 4%]369tests/test_call_policy_health_guards.py ......... [ 4%]370tests/test_ccr.py ...................... [ 5%]371tests/test_ccr_http_session.py ....... [ 5%]372tests/test_ccr_lossless.py .......................... [ 6%]373tests/test_claude_plugin_package.py .............. [ 6%]374tests/test_cli_credit.py ........................ [ 7%]375tests/test_cli_credit_more.py ......... [ 7%]376tests/test_cli_exit_codes.py .... [ 7%]377tests/test_cli_flags.py ................... [ 8%]378tests/test_cli_smoke.py ....... [ 8%]379tests/test_cli_stdin_encoding.py .......... [ 9%]380tests/test_cli_suggestions.py .... [ 9%]381tests/test_client.py .............................. [ 10%]382tests/test_command_coverage.py ......... [ 10%]383tests/test_completion.py ........... [ 10%]384tests/test_compressor.py .................................. [ 12%]385tests/test_config.py .................... [ 12%]386tests/test_config_atomic_and_unset.py ............ [ 13%]387tests/test_dead_server_diagnostics.py F. [ 13%]388tests/test_demo.py ...................... [ 13%]389tests/test_demo_dead_package.py ....... [ 14%]390tests/test_demo_server.py .............................................. [ 15%]391..... [ 15%]392tests/test_dir_isolation.py ... [ 15%]393tests/test_discover.py ........................................... [ 17%]394tests/test_docs.py .............................................. [ 18%]395tests/test_doctor_errors.py ............ [ 19%]396tests/test_doctor_json_config_strip_remove_multi.py ....... [ 19%]397tests/test_doctor_star_hint.py ....... [ 19%]398tests/test_doctor_statusline.py .... [ 19%]399tests/test_empty_machine_output.py ...... [ 20%]400tests/test_envelope.py ........ [ 20%]401tests/test_error_streams.py ........... [ 20%]402tests/test_exec_sandbox.py ................. [ 21%]403tests/test_exit_codes.py ......................... [ 22%]404tests/test_exit_codes_and_headers.py ............ [ 22%]405tests/test_fallback_json.py ...... [ 22%]406tests/test_faq_page.py ... [ 22%]407tests/test_floodguard.py ........ [ 23%]408tests/test_footer_broadcast.py ......................................... [ 24%]409.......... [ 24%]410tests/test_footprint_claims.py ............ [ 25%]411tests/test_gemini_manifest.py ...... [ 25%]412tests/test_graphql.py ..................................s [ 26%]413tests/test_health.py .............. [ 27%]414tests/test_help_per_command.py ....... [ 27%]415tests/test_help_shortcircuit.py ......... [ 27%]416tests/test_honest_counts.py ................ [ 28%]417tests/test_http_user_agent.py ......... [ 28%]418tests/test_import.py ..................... [ 29%]419tests/test_inspect_list_help_version.py ........ [ 29%]420tests/test_installer_registry.py ....................................... [ 30%]421 [ 30%]422tests/test_issue34_call_timeout.py ................. [ 31%]423tests/test_json_schema_version.py ......s [ 31%]424tests/test_kb.py ................... [ 32%]425tests/test_lang.py .............................. [ 33%]426tests/test_list_manifest_toggle_flags.py ......... [ 33%]427tests/test_llms_txt.py ...... [ 33%]428tests/test_machine_readable_output.py .......................... [ 34%]429tests/test_manifest.py .. [ 34%]430tests/test_mcp2cli_parity.py ......................................... [ 35%]431tests/test_mcp_extras.py ........................ [ 36%]432tests/test_mode_delivery_surfaces.py ................................... [ 37%]433......................... [ 38%]434tests/test_mode_recommend.py .............. [ 39%]435tests/test_native_tools.py ............................................. [ 40%]436............................ [ 41%]437tests/test_next_step_works.py .................. [ 42%]438tests/test_oauth.py ......................................... [ 43%]439tests/test_openapi.py .................................................. [ 45%]440...s [ 45%]441tests/test_output.py ................................................... [ 47%]442........................................................................ [ 49%]443.................. [ 50%]444tests/test_percent_caliber.py .... [ 50%]445tests/test_plugin_install.py ........... [ 50%]446tests/test_plugin_scan.py ............................... [ 51%]447tests/test_policy_clear_missing.py .. [ 51%]448tests/test_policy_json_retrieve_exit.py ..... [ 51%]449tests/test_policy_overrides.py ................ [ 52%]450tests/test_presence.py ................................................. [ 53%]451............... [ 54%]452tests/test_presence_discoverability.py ............ [ 54%]453tests/test_presence_i18n.py .......... [ 55%]454tests/test_presence_native.py ............. [ 55%]455tests/test_presence_round10.py ............... [ 56%]456tests/test_presence_round11.py ................. [ 56%]457tests/test_presence_round5.py ................ [ 57%]458tests/test_presence_round6.py ............ [ 57%]459tests/test_presence_round7.py ............. [ 58%]460tests/test_presence_round8.py ............ [ 58%]461tests/test_presence_round9.py .................... [ 59%]462tests/test_quickstart_guidance.py .... [ 59%]463tests/test_readme_links.py ... [ 59%]464tests/test_registry_sync.py ............. [ 59%]465tests/test_release_tooling.py ... [ 59%]466tests/test_remove_clears_cache.py ... [ 59%]467tests/test_report.py ..................... [ 60%]468tests/test_reversible.py ............................................... [ 62%]469............................. [ 63%]470tests/test_router.py ................................................... [ 64%]471..... [ 65%]472tests/test_savings.py .......... [ 65%]473tests/test_schema_call_e2e.py ... [ 65%]474tests/test_search.py ................................... [ 66%]475tests/test_search_head_envelope_toggle.py ........ [ 66%]476tests/test_select_cli.py .... [ 67%]477tests/test_select_engine.py ................. [ 67%]478tests/test_select_head.py ... [ 67%]479tests/test_self_entry_guard.py ............... [ 68%]480tests/test_serve.py .................................................... [ 69%]481............... [ 70%]482tests/test_serve_background.py ............................... [ 71%]483tests/test_serve_perf.py .......... [ 71%]484tests/test_serve_prompts.py ........ [ 72%]485tests/test_session_log.py ............... [ 72%]486tests/test_skill_package.py ..............s...................... [ 73%]487tests/test_skill_packs.py ................ [ 74%]488tests/test_skill_search.py .......... [ 74%]489tests/test_skills.py ................................................... [ 76%]490.....................ss................................................. [ 78%]491................................................................... [ 80%]492tests/test_smart_compress_e2e.py .................. [ 81%]493tests/test_smart_reachability.py ..... [ 81%]494tests/test_source_tracked.py sss [ 81%]495tests/test_stats_toggle.py ......... [ 82%]496tests/test_status_skills_staleness.py .... [ 82%]497tests/test_statusline_install.py ....................... [ 83%]498tests/test_stderr_pipe_deadlock.py .... [ 83%]499tests/test_subprocess_encoding.py . [ 83%]500tests/test_sync.py ..................................................... [ 84%]501.................................................... [ 86%]502tests/test_sync_claims_tree.py ...... [ 86%]503tests/test_tier_claims_consistent.py .... [ 87%]504tests/test_toml_config.py .......................... [ 87%]505tests/test_toon_cross_validate.py ............................... [ 88%]506tests/test_typo_and_flag_validation.py ......... [ 89%]507tests/test_uninstall_end_to_end.py .......... [ 89%]508tests/test_update.py .................... [ 90%]509tests/test_upgrade.py ................................. [ 91%]510tests/test_ux_enhancements.py .............................. [ 92%]511tests/test_v02_features.py .................................... [ 93%]512tests/test_v04_features.py ................ [ 94%]513tests/test_v05_features.py ....................... [ 94%]514tests/test_v072_delight.py .....................s.. [ 95%]515tests/test_v073_http_security.py ............................... [ 96%]516tests/test_v074_stdio_timeout.py ............. [ 97%]517tests/test_v076_stateless_serve.py ................... [ 97%]518tests/test_v07_spec2026.py ..................... [ 98%]519tests/test_v081_env_headers.py ............. [ 98%]520tests/test_watch.py ..................... [ 99%]521tests/test_xdg.py ............. [100%]522523=================================== FAILURES ===================================524_ TestDiagnosticSurvivesTruncation.test_diagnostic_past_the_warning_block_is_reported _525526self = <tests.test_dead_server_diagnostics.TestDiagnosticSurvivesTruncation testMethod=test_diagnostic_past_the_warning_block_is_reported>527528 def test_diagnostic_past_the_warning_block_is_reported(self):529 client = MCPClient(stdio=_DEAD_SERVER, timeout=10)530 try:531 with self.assertRaises(MCPError) as cm:532 client.initialize()533 finally:534 try:535 client.close()536 except Exception:537 pass538> self.assertEqual(cm.exception.code, "PROCESS_DIED")539E AssertionError: 'RESPONSE_TIMEOUT' != 'PROCESS_DIED'540E - RESPONSE_TIMEOUT541E + PROCESS_DIED542543tests/test_dead_server_diagnostics.py:78: AssertionError544=============================== warnings summary ===============================545../../nix/store/0zm37a70sfgc2zwgbwv9kv75hlv5d4lc-python3.14-pytest-9.1.1/lib/python3.14/site-packages/_pytest/config/__init__.py:1464546 /nix/store/0zm37a70sfgc2zwgbwv9kv75hlv5d4lc-python3.14-pytest-9.1.1/lib/python3.14/site-packages/_pytest/config/__init__.py:1464: PytestConfigWarning: Unknown config option: timeout547 548 self._warn_or_fail_if_strict(f"Unknown config option: {key}\n")549550../../nix/store/0zm37a70sfgc2zwgbwv9kv75hlv5d4lc-python3.14-pytest-9.1.1/lib/python3.14/site-packages/_pytest/config/__init__.py:1464551 /nix/store/0zm37a70sfgc2zwgbwv9kv75hlv5d4lc-python3.14-pytest-9.1.1/lib/python3.14/site-packages/_pytest/config/__init__.py:1464: PytestConfigWarning: Unknown config option: timeout_method552 553 self._warn_or_fail_if_strict(f"Unknown config option: {key}\n")554555-- Docs: https://docs.pytest.org/en/stable/how-to/capture-warnings.html556=========================== short test summary info ============================557FAILED tests/test_dead_server_diagnostics.py::TestDiagnosticSurvivesTruncation::test_diagnostic_past_the_warning_block_is_reported - AssertionError: 'RESPONSE_TIMEOUT' != 'PROCESS_DIED'558= 1 failed, 2989 passed, 15 skipped, 7 deselected, 2 warnings in 177.28s (0:02:57) =