setup
checks.aarch64-linux.pkgs-mcptoon
· build #9087
· raw
1these 3 derivations will be built:2 /nix/store/b4dwpdwlfpnr9k4injirp8kdljh5yd6s-source.drv3 /nix/store/mb06rqh7002z0bzl9h77s9lm1vlh8yql-mcptoon-0.8.30.drv4 /nix/store/i8nhacbdfyma75zlh66m6pll04cyl1h6-check-mcptoon.drv5error: build of '/nix/store/mb06rqh7002z0bzl9h77s9lm1vlh8yql-mcptoon-0.8.30.drv' on 'grpc://farm.numtide.com:50051?connect-timeout=21&system=aarch64-linux&token-file=/run/nix-farm-client/farm-token' failed: Cannot build '/nix/store/mb06rqh7002z0bzl9h77s9lm1vlh8yql-mcptoon-0.8.30.drv'.6 Reason: builder failed with exit code 1.7 Output paths:8 /nix/store/l1319bzbjd2kik5x14vrl8ldnn29vkfn-mcptoon-0.8.30-dist9 /nix/store/vgia4bcj8ac6lmvbx0ivwghm6j88g5jq-mcptoon-0.8.3010 Last 25 log lines:11 > try:12 > client.close()13 > except Exception:14 > pass15 > > self.assertEqual(cm.exception.code, "PROCESS_DIED")16 > E AssertionError: 'RESPONSE_TIMEOUT' != 'PROCESS_DIED'17 > E - RESPONSE_TIMEOUT18 > E + PROCESS_DIED19 >20 > tests/test_dead_server_diagnostics.py:78: AssertionError21 > =============================== warnings summary ===============================22 > ../../nix/store/0zm37a70sfgc2zwgbwv9kv75hlv5d4lc-python3.14-pytest-9.1.1/lib/python3.14/site-packages/_pytest/config/__init__.py:146423 > /nix/store/0zm37a70sfgc2zwgbwv9kv75hlv5d4lc-python3.14-pytest-9.1.1/lib/python3.14/site-packages/_pytest/config/__init__.py:1464: PytestConfigWarning: Unknown config option: timeout24 >25 > self._warn_or_fail_if_strict(f"Unknown config option: {key}\n")26 >27 > ../../nix/store/0zm37a70sfgc2zwgbwv9kv75hlv5d4lc-python3.14-pytest-9.1.1/lib/python3.14/site-packages/_pytest/config/__init__.py:146428 > /nix/store/0zm37a70sfgc2zwgbwv9kv75hlv5d4lc-python3.14-pytest-9.1.1/lib/python3.14/site-packages/_pytest/config/__init__.py:1464: PytestConfigWarning: Unknown config option: timeout_method29 >30 > self._warn_or_fail_if_strict(f"Unknown config option: {key}\n")31 >32 > -- Docs: https://docs.pytest.org/en/stable/how-to/capture-warnings.html33 > =========================== short test summary info ============================34 > FAILED tests/test_dead_server_diagnostics.py::TestDiagnosticSurvivesTruncation::test_diagnostic_past_the_warning_block_is_reported - AssertionError: 'RESPONSE_TIMEOUT' != 'PROCESS_DIED'35 > = 1 failed, 2989 passed, 15 skipped, 7 deselected, 2 warnings in 177.28s (0:02:57) =36 For full logs, run:37 nix log /nix/store/mb06rqh7002z0bzl9h77s9lm1vlh8yql-mcptoon-0.8.30.drv38error: Cannot build '/nix/store/mb06rqh7002z0bzl9h77s9lm1vlh8yql-mcptoon-0.8.30.drv'.39 Reason: builder failed with exit code 1.40 Output paths:41 /nix/store/l1319bzbjd2kik5x14vrl8ldnn29vkfn-mcptoon-0.8.30-dist42 /nix/store/vgia4bcj8ac6lmvbx0ivwghm6j88g5jq-mcptoon-0.8.3043error: Cannot build '/nix/store/i8nhacbdfyma75zlh66m6pll04cyl1h6-check-mcptoon.drv'.44 Reason: 1 dependency failed.45 Output paths:46 /nix/store/b782r071kcps2h52xhz533pzqfdfa7ps-check-mcptoon