nixbot

builds

succeeded kandev-0.98.0 checks.x86_64-linux.pkgs-kandev · build #8999 · raw

1bld1: building 0k8hm5r41hxaqgyv3zd4ngl6qw3x5rw5-kandev-0.98.0.drv2Using versionCheckHook
unpackPhase
3unpacking source archive /nix/store/m93k4sl5qzf1b0y6mw5gw9lry5j9b56b-source4source root is source5unpackPhase completed in 32 seconds
patchPhase
6applying patch /nix/store/0znrx9v7zc42qb8cc2qiwh2rlwhyph2a-prefer-native-acp-runtimes.patch7patching file apps/backend/internal/agent/agents/copilot_acp.go8patching file apps/backend/internal/agent/agents/copilot_acp_test.go9patching file apps/backend/internal/agent/agents/droid_acp.go10patching file apps/backend/internal/agent/agents/gemini.go11patching file apps/backend/internal/agent/agents/kilocode_acp.go12patching file apps/backend/internal/agent/agents/native_binary_agents_test.go13patching file apps/backend/internal/agent/agents/qwen_acp.go14patching file apps/backend/internal/agent/hostutility/manager.go15Hunk #3 FAILED at 861.161 out of 3 hunks FAILED -- saving rejects to file apps/backend/internal/agent/hostutility/manager.go.rej17patching file apps/backend/internal/agent/hostutility/native_binary_test.go18patching file apps/backend/internal/agent/registry/provider.go19Hunk #2 succeeded at 135 with fuzz 1 (offset 1 line).20patching file apps/backend/internal/agent/runtime/lifecycle/manager_launch.go21Hunk #1 FAILED at 711.221 out of 1 hunk FAILED -- saving rejects to file apps/backend/internal/agent/runtime/lifecycle/manager_launch.go.rej23patching file apps/backend/internal/agent/runtime/lifecycle/manager_launch_test.go24Hunk #1 succeeded at 158 (offset 21 lines).25Hunk #2 succeeded at 173 with fuzz 2 (offset 21 lines).26patching file apps/backend/internal/agent/runtime/lifecycle/utility.go27patching file apps/backend/internal/agent/runtime/lifecycle/utility_test.go28patching file apps/backend/internal/agent/settings/controller/agent_config.go29patching file apps/backend/internal/agent/settings/controller/controller_test.go30patching file apps/backend/internal/agentctl/server/utility/acp_executor.go31Hunk #1 succeeded at 1297 (offset 3 lines).32Hunk #2 succeeded at 1314 (offset 3 lines).33patching file apps/backend/internal/agentctl/server/utility/probe_allowlist_test.go