kandev-0.98.0
checks.x86_64-linux.pkgs-kandev-desktop
· build #8999
· raw
1attached to the build already running on this worker2bld1: building 0k8hm5r41hxaqgyv3zd4ngl6qw3x5rw5-kandev-0.98.0.drv3Using versionCheckHook
unpackPhase
4unpacking source archive /nix/store/m93k4sl5qzf1b0y6mw5gw9lry5j9b56b-source5source root is source6unpackPhase completed in 32 secondspatchPhase
7applying patch /nix/store/0znrx9v7zc42qb8cc2qiwh2rlwhyph2a-prefer-native-acp-runtimes.patch8patching file apps/backend/internal/agent/agents/copilot_acp.go9patching file apps/backend/internal/agent/agents/copilot_acp_test.go10patching file apps/backend/internal/agent/agents/droid_acp.go11patching file apps/backend/internal/agent/agents/gemini.go12patching file apps/backend/internal/agent/agents/kilocode_acp.go13patching file apps/backend/internal/agent/agents/native_binary_agents_test.go14patching file apps/backend/internal/agent/agents/qwen_acp.go15patching file apps/backend/internal/agent/hostutility/manager.go16Hunk #3 FAILED at 861.171 out of 3 hunks FAILED -- saving rejects to file apps/backend/internal/agent/hostutility/manager.go.rej18patching file apps/backend/internal/agent/hostutility/native_binary_test.go19patching file apps/backend/internal/agent/registry/provider.go20Hunk #2 succeeded at 135 with fuzz 1 (offset 1 line).21patching file apps/backend/internal/agent/runtime/lifecycle/manager_launch.go22Hunk #1 FAILED at 711.231 out of 1 hunk FAILED -- saving rejects to file apps/backend/internal/agent/runtime/lifecycle/manager_launch.go.rej24patching file apps/backend/internal/agent/runtime/lifecycle/manager_launch_test.go25Hunk #1 succeeded at 158 (offset 21 lines).26Hunk #2 succeeded at 173 with fuzz 2 (offset 21 lines).27patching file apps/backend/internal/agent/runtime/lifecycle/utility.go28patching file apps/backend/internal/agent/runtime/lifecycle/utility_test.go29patching file apps/backend/internal/agent/settings/controller/agent_config.go30patching file apps/backend/internal/agent/settings/controller/controller_test.go31patching file apps/backend/internal/agentctl/server/utility/acp_executor.go32Hunk #1 succeeded at 1297 (offset 3 lines).33Hunk #2 succeeded at 1314 (offset 3 lines).34patching file apps/backend/internal/agentctl/server/utility/probe_allowlist_test.go