kandev-0.98.0
checks.aarch64-darwin.pkgs-kandev
· build #8999
· raw
1mac02: building v5r3cffy1hb2gpd456ixgcc59ha9mp2s-kandev-0.98.0.drv2Using versionCheckHook
unpackPhase
3unpacking source archive /nix/store/m93k4sl5qzf1b0y6mw5gw9lry5j9b56b-source4source root is sourcepatchPhase
5applying patch /nix/store/0znrx9v7zc42qb8cc2qiwh2rlwhyph2a-prefer-native-acp-runtimes.patch6patching file apps/backend/internal/agent/agents/copilot_acp.go7patching file apps/backend/internal/agent/agents/copilot_acp_test.go8patching file apps/backend/internal/agent/agents/droid_acp.go9patching file apps/backend/internal/agent/agents/gemini.go10patching file apps/backend/internal/agent/agents/kilocode_acp.go11patching file apps/backend/internal/agent/agents/native_binary_agents_test.go12patching file apps/backend/internal/agent/agents/qwen_acp.go13patching file apps/backend/internal/agent/hostutility/manager.go14Hunk #3 FAILED at 861.151 out of 3 hunks FAILED -- saving rejects to file apps/backend/internal/agent/hostutility/manager.go.rej16patching file apps/backend/internal/agent/hostutility/native_binary_test.go17patching file apps/backend/internal/agent/registry/provider.go18Hunk #2 succeeded at 135 with fuzz 1 (offset 1 line).19patching file apps/backend/internal/agent/runtime/lifecycle/manager_launch.go20Hunk #1 FAILED at 711.211 out of 1 hunk FAILED -- saving rejects to file apps/backend/internal/agent/runtime/lifecycle/manager_launch.go.rej22patching file apps/backend/internal/agent/runtime/lifecycle/manager_launch_test.go23Hunk #1 succeeded at 158 (offset 21 lines).24Hunk #2 succeeded at 173 with fuzz 2 (offset 21 lines).25patching file apps/backend/internal/agent/runtime/lifecycle/utility.go26patching file apps/backend/internal/agent/runtime/lifecycle/utility_test.go27patching file apps/backend/internal/agent/settings/controller/agent_config.go28patching file apps/backend/internal/agent/settings/controller/controller_test.go29patching file apps/backend/internal/agentctl/server/utility/acp_executor.go30Hunk #1 succeeded at 1297 (offset 3 lines).31Hunk #2 succeeded at 1314 (offset 3 lines).32patching file apps/backend/internal/agentctl/server/utility/probe_allowlist_test.go