nixbot

builds

numtide/llm-agents.nix build #8998 failed

branch main · PR #11085 · commit dce87a0d59 · · took 35m 39s · eval 2m 14s

eval warnings 2 kinds · 2 occurrences
  • warn setting 'accept-flake-config' is ignored: iets never applies a flake's nixConfig, so a flake that sets extra-substituters or allow-import-from-derivation there runs without them; put the settings in nix.conf ×1
  • warn setting 'plugin-files' is ignored: iets loads no plugins ×1

10 failed
failed attributes
status attribute duration
failed checks.aarch64-darwin.pkgs-codex-auth 10m 6s
codex-auth-0.3.1: /nix/store/bg372xp0r29mh7qigkbx1gb3j50nnmcl-zig-0.17.0/lib/zig/std/Build.zig:1:1: note: struct declared here const Build = @This(); ^~~~~ refe …
codex-auth-0.3.1:
/nix/store/bg372xp0r29mh7qigkbx1gb3j50nnmcl-zig-0.17.0/lib/zig/std/Build.zig:1:1: note: struct declared here
const Build = @This();
^~~~~
referenced by:
    runPackageScript [inlined]: /nix/store/bg372xp0r29mh7qigkbx1gb3j50nnmcl-zig-0.17.0/lib/zig/std/Build.zig:2144:50
    main: /nix/store/bg372xp0r29mh7qigkbx1gb3j50nnmcl-zig-0.17.0/lib/zig/compiler/configurer.zig:138:29
    3 reference(s) hidden; use '-freference-trace=5' to see all references
error: command reported 1 compilation errors: /nix/store/bg372xp0r29mh7qigkbx1gb3j50nnmcl-zig-0.17.0/bin/zig build-exe --cache-dir .zig-cache --global-cache-dir /nix/var/nix/builds/nix-60829-3519365473/tmp.AQuCQ1kmJV --build-root . --zig-lib-dir /nix/store/bg372xp0r29mh7qigkbx1gb3j50nnmcl-zig-0.17.0/lib/zig --name configurer -fsingle-threaded --dep @build --dep @dependencies -Mroot=/nix/store/bg372xp0r29mh7qigkbx1gb3j50nnmcl-zig-0.17.0/lib/zig/compiler/configurer.zig -M@dependencies=.zig-cache/o/ce72526ee7fc0580e3a089da327c554a/dependencies.zig -M@build=build.zig --listen=-
failed checks.aarch64-darwin.pkgs-opencode2-desktop 10m 11s
setup: these 2 derivations will be built: /nix/store/7y1sy4kp83ncn02h16kqmlcv0lf3ph3l-opencode2-desktop-2.1.4.drv /nix/store/0djmi6bwq34bbn5f3xcnhlm1cxnq6dl …
setup:
these 2 derivations will be built:
  /nix/store/7y1sy4kp83ncn02h16kqmlcv0lf3ph3l-opencode2-desktop-2.1.4.drv
  /nix/store/0djmi6bwq34bbn5f3xcnhlm1cxnq6dl0-check-opencode2-desktop.drv
could not copy /nix/store/l6v97h63vxv9np0wh2hw9i7ca7l487ap-opencode2-desktop-2.1.4: error: gRPC FetchNars failed: failed to connect to all addresses; last error: UNKNOWN: ipv4:127.0.0.2:50051: tcp handshaker shutdown
error: some outputs are unexpectedly invalid
failed checks.aarch64-darwin.pkgs-opencodex 10m 28s
setup: these 5 derivations will be built: /nix/store/xdx0dr599562ip1dwl5c3103vnmnvz0n-bun-pkg-body-parser-2.4.0.drv /nix/store/zrm35xlzhmgxifn5y9gcjkm4dz4mm …
setup:
these 5 derivations will be built:
  /nix/store/xdx0dr599562ip1dwl5c3103vnmnvz0n-bun-pkg-body-parser-2.4.0.drv
  /nix/store/zrm35xlzhmgxifn5y9gcjkm4dz4mma2j-bun-pkg-zod-4.6.6.drv
  /nix/store/zgczn1fzc4r5yxyclc691h8a7faxjq74-bun-cache.drv
  /nix/store/dxyffgdc4zhn138n66yygzm2lmgdn63k-opencodex-2.92.0.drv
  /nix/store/gzigbjsqy6dxnj25k4234rz4mh8c5mi9-check-opencodex.drv
could not copy /nix/store/6ajf4fhgxz45cl0sld0axzqdq36mjn9i-bun-pkg-body-parser-2.4.0: error: gRPC FetchNars failed: failed to connect to all addresses; last error: UNKNOWN: ipv6:%5B2a01:4f9:3071:1fc8::1%5D:50051: handshaker shutdown
error: some outputs are unexpectedly invalid
failed checks.aarch64-darwin.pkgs-openresearch 5m 15s
setup: these 3 derivations will be built: /nix/store/bq0b3hip3lkr6dfnqskdy4fpc7hbq3la-openresearch-0.2.21-vendor.drv /nix/store/w9rdkwh6gf8b0kyz3l7z80aw4dvb …
setup:
these 3 derivations will be built:
  /nix/store/bq0b3hip3lkr6dfnqskdy4fpc7hbq3la-openresearch-0.2.21-vendor.drv
  /nix/store/w9rdkwh6gf8b0kyz3l7z80aw4dvbdccc-openresearch-0.2.21.drv
  /nix/store/7xpqj4iaz720v590v5zcl7w7d64sc7qv-check-openresearch.drv
could not copy /nix/store/b998kqwgchpq7kz8sl9g4m6ybmn6ygrm-openresearch-0.2.21-vendor: error: gRPC FetchNars failed: failed to connect to all addresses; last error: UNKNOWN: ipv4:65.21.215.17:50051: Handshake read failed
error: some outputs are unexpectedly invalid
failed checks.aarch64-darwin.pkgs-openspec 1m 25s
setup: these 3 derivations will be built: /nix/store/v3zar1rl2dm35j3fav7acs7bqizmwf9h-openspec-src-with-lock.drv /nix/store/qpgv3va32j6navqa9qn5p5a94m2gfqli …
setup:
these 3 derivations will be built:
  /nix/store/v3zar1rl2dm35j3fav7acs7bqizmwf9h-openspec-src-with-lock.drv
  /nix/store/qpgv3va32j6navqa9qn5p5a94m2gfqli-openspec-1.15.0.drv
  /nix/store/p3zjr9rdpvm0z2xn4lks3apmz04660nb-check-openspec.drv
could not copy /nix/store/gp8lgdz7pvd5kx553f6s2i30b6fj24cz-openspec-src-with-lock: error: gRPC FetchNars failed: failed to connect to all addresses; last error: UNKNOWN: ipv4:65.21.215.17:50051: tcp handshaker shutdown
error: some outputs are unexpectedly invalid
failed checks.aarch64-darwin.pkgs-paperclip 15m 41s
check-paperclip: mac02: building g4f6k6wx9z9zrvchi617ff5bvk3yhivj-check-paperclip.drv
check-paperclip:
mac02: building g4f6k6wx9z9zrvchi617ff5bvk3yhivj-check-paperclip.drv
failed checks.aarch64-linux.pkgs-chatgpt 31s
chatgpt-unwrapped-26.1021.22027: /nix/store/qzxwwzl3gxyvwmi0ac1gjqz3ihvx3icj-chatgpt-unwrapped-26.1021.22027/lib/chatgpt/resources/plugins/openai-bundled/plugin …
chatgpt-unwrapped-26.1021.22027:
/nix/store/qzxwwzl3gxyvwmi0ac1gjqz3ihvx3icj-chatgpt-unwrapped-26.1021.22027/lib/chatgpt/resources/plugins/openai-bundled/plugins/latex/scripts/build_private_bundle.sh: interpreter directive changed from "#!/usr/bin/env bash" to "/nix/store/czx7cscpnqqmc9nwmbpnv2zcvck64mmf-bash-5.3p20/bin/bash"
/nix/store/qzxwwzl3gxyvwmi0ac1gjqz3ihvx3icj-chatgpt-unwrapped-26.1021.22027/lib/chatgpt/resources/plugins/openai-bundled/plugins/codex-app-tools/scripts/launch_codex_app_tools_mcp: interpreter directive changed from "#!/bin/sh" to "/nix/store/czx7cscpnqqmc9nwmbpnv2zcvck64mmf-bash-5.3p20/bin/sh"
auto-formatelf: ignoring missing liblog.so wanted by /nix/store/qzxwwzl3gxyvwmi0ac1gjqz3ihvx3icj-chatgpt-unwrapped-26.1021.22027/lib/chatgpt/resources/app.asar.unpacked/node_modules/@worklouder/device-kit-oai/node_modules/@worklouder/wl-device-kit/node_modules/serialport/node_modules/@serialport/bindings-cpp/prebuilds/android-arm64/node.napi.armv8.node
auto-formatelf: ignoring missing libc++_shared.so wanted by /nix/store/qzxwwzl3gxyvwmi0ac1gjqz3ihvx3icj-chatgpt-unwrapped-26.1021.22027/lib/chatgpt/resources/app.asar.unpacked/node_modules/@worklouder/device-kit-oai/node_modules/@worklouder/wl-device-kit/node_modules/serialport/node_modules/@serialport/bindings-cpp/prebuilds/android-arm64/node.napi.armv8.node
auto-formatelf: libtss2-esys.so.0 not found, wanted by /nix/store/qzxwwzl3gxyvwmi0ac1gjqz3ihvx3icj-chatgpt-unwrapped-26.1021.22027/lib/chatgpt/resources/native/remote-control-device-key.node
auto-formatelf: libtss2-mu.so.0 not found, wanted by /nix/store/qzxwwzl3gxyvwmi0ac1gjqz3ihvx3icj-chatgpt-unwrapped-26.1021.22027/lib/chatgpt/resources/native/remote-control-device-key.node
auto-formatelf: libtss2-tcti-device.so.0 not found, wanted by /nix/store/qzxwwzl3gxyvwmi0ac1gjqz3ihvx3icj-chatgpt-unwrapped-26.1021.22027/lib/chatgpt/resources/native/remote-control-device-key.node
auto-formatelf: auto-formatelf could not satisfy all dependencies; add them to --libs or pass --ignore-missing
failed checks.aarch64-linux.pkgs-codex-auth 3m 22s
codex-auth-0.3.1: /nix/store/m1n2vd43b8bapyw2zm66c7jhxazimrvn-zig-0.17.0/lib/zig/std/Build.zig:1:1: note: struct declared here const Build = @This(); ^~~~~ refe …
codex-auth-0.3.1:
/nix/store/m1n2vd43b8bapyw2zm66c7jhxazimrvn-zig-0.17.0/lib/zig/std/Build.zig:1:1: note: struct declared here
const Build = @This();
^~~~~
referenced by:
    runPackageScript [inlined]: /nix/store/m1n2vd43b8bapyw2zm66c7jhxazimrvn-zig-0.17.0/lib/zig/std/Build.zig:2144:50
    main: /nix/store/m1n2vd43b8bapyw2zm66c7jhxazimrvn-zig-0.17.0/lib/zig/compiler/configurer.zig:138:29
    4 reference(s) hidden; use '-freference-trace=6' to see all references
error: command reported 1 compilation errors: /nix/store/m1n2vd43b8bapyw2zm66c7jhxazimrvn-zig-0.17.0/bin/zig build-exe --cache-dir .zig-cache --global-cache-dir /build/tmp.iL3Gy5J6DC --build-root . --zig-lib-dir /nix/store/m1n2vd43b8bapyw2zm66c7jhxazimrvn-zig-0.17.0/lib/zig --name configurer -fsingle-threaded --dep @build --dep @dependencies -Mroot=/nix/store/m1n2vd43b8bapyw2zm66c7jhxazimrvn-zig-0.17.0/lib/zig/compiler/configurer.zig -M@dependencies=.zig-cache/o/ce72526ee7fc0580e3a089da327c554a/dependencies.zig -M@build=build.zig --listen=-
failed checks.x86_64-linux.pkgs-chatgpt 1m 30s
setup: /nix/store/drpcy2zf7ba2fmfv557fgnqjyv31w0hs-qttranslations-5.15.19 /nix/store/hjbmdwhyh3jwjq6qz5f1i05xp23j4z0h-qttranslations-6.12.0 /nix/store/fmg …
setup:
  /nix/store/drpcy2zf7ba2fmfv557fgnqjyv31w0hs-qttranslations-5.15.19
  /nix/store/hjbmdwhyh3jwjq6qz5f1i05xp23j4z0h-qttranslations-6.12.0
  /nix/store/fmg6kh4sx6ljgwqnxccc5j7y1ps572j5-systemd-262
  /nix/store/0hy2nf8jpi8vyl93jn8djlg8b40m7ih0-systemd-262-dev
  /nix/store/ljdkkww2qchiqq6zc2yc6yab4lgfx7nb-tpm2-tss-4.2.0
  /nix/store/kp8rsys8w6m2n4pa8nbsa0v1knfgrir5-wrap-gapps-hook
warning: ignoring the client-specified setting 'store', because it is a restricted setting and you are not a trusted user
error: dependency 'b8xv3rh0nyxygmkfpwr9lskr0bvz85vf-chatgpt-26.1021.22027.drv' failed
failed checks.x86_64-linux.pkgs-codex-auth 9m 28s
setup: don't know how to build these paths: /nix/store/ialca1fk3jzfdsgzxkih29xlwsy57njj-check-codex-auth.drv warning: ignoring the client-specified setting 's …
setup:
don't know how to build these paths:
  /nix/store/ialca1fk3jzfdsgzxkih29xlwsy57njj-check-codex-auth.drv
warning: ignoring the client-specified setting 'store', because it is a restricted setting and you are not a trusted user
error: dependency 'yk3j1c7fgy75q6bjx5q3hndpyi0p474p-codex-auth-0.3.1.drv' failed
88 succeeded
succeeded attributes
status attribute duration
loading…
596 already built
skipped attributes
status attribute duration
loading…