nixbot

builds

numtide/llm-agents.nix build #8966 failed

branch main · PR #11085 · commit 3c69c2f63b · · took 48m 31s · eval 2m 43s

eval warnings 2 kinds · 2 occurrences
  • warn setting 'accept-flake-config' is ignored: iets never applies a flake's nixConfig, so a flake that sets extra-substituters or allow-import-from-derivation there runs without them; put the settings in nix.conf ×1
  • warn setting 'plugin-files' is ignored: iets loads no plugins ×1

28 failed
failed attributes
status attribute duration
failed checks.aarch64-darwin.codesign-qoder-cli-cn 25s
codesign-check-qoder-cli-cn: unpacking source archive /nix/store/k34x22lh5l3ryai5xmknplcipsg7ykck-qoderclicn-darwin-arm64.tar.gz codesignCheckHook: checking /ni …
codesign-check-qoder-cli-cn:
unpacking source archive /nix/store/k34x22lh5l3ryai5xmknplcipsg7ykck-qoderclicn-darwin-arm64.tar.gz
codesignCheckHook: checking /nix/var/nix/builds/nix-95815-3230623158/tmp.LZRemuo5rK/qoderclicn
(the verify command is known to be buggy and gives misleading results; we highly recommend using Apple's tooling until this message is removed)
no problems detected!
(we do not verify everything so please do not assume that the signature meets Apple standards)
CMS Verification successful
codesignCheckHook: verified 1 Mach-O binaries for team 9DFNGU9AK5
no Makefile or custom installCheckPhase, doing nothing
failed checks.aarch64-darwin.pkgs-ai-memory 1m 12s
setup: these 3 derivations will be built: /nix/store/6yrcqsd8ldchx0v0g1hv9si44m5g1cil-ai-memory-3.2.2-vendor.drv /nix/store/kvvr99yh3z92rxg3fgnpk5rzhxqx6q7k …
setup:
these 3 derivations will be built:
  /nix/store/6yrcqsd8ldchx0v0g1hv9si44m5g1cil-ai-memory-3.2.2-vendor.drv
  /nix/store/kvvr99yh3z92rxg3fgnpk5rzhxqx6q7k-ai-memory-3.2.2.drv
  /nix/store/ql8biiwd1kgac2r0k9jqkic9lcpyasms-check-ai-memory.drv
could not copy /nix/store/fnpcly4rjsl8wqgj6ynn4alcvzmc2zpv-ai-memory-3.2.2-vendor: error: gRPC FetchNars failed: Stream removed (Socket closed)
error: some outputs are unexpectedly invalid
failed checks.aarch64-darwin.pkgs-amp 37s
check-amp: mac02: building w6zf9kb4ph25q6q41jiml54wqx44amr9-check-amp.drv
check-amp:
mac02: building w6zf9kb4ph25q6q41jiml54wqx44amr9-check-amp.drv
failed checks.aarch64-darwin.pkgs-codex-auth 49s
codex-auth-0.3.1: /nix/store/bg372xp0r29mh7qigkbx1gb3j50nnmcl-zig-0.17.0/lib/zig/std/Build.zig:1:1: note: struct declared here const Build = @This(); ^~~~~ refe …
codex-auth-0.3.1:
/nix/store/bg372xp0r29mh7qigkbx1gb3j50nnmcl-zig-0.17.0/lib/zig/std/Build.zig:1:1: note: struct declared here
const Build = @This();
^~~~~
referenced by:
    runPackageScript [inlined]: /nix/store/bg372xp0r29mh7qigkbx1gb3j50nnmcl-zig-0.17.0/lib/zig/std/Build.zig:2144:50
    main: /nix/store/bg372xp0r29mh7qigkbx1gb3j50nnmcl-zig-0.17.0/lib/zig/compiler/configurer.zig:138:29
    3 reference(s) hidden; use '-freference-trace=5' to see all references
error: command reported 1 compilation errors: /nix/store/bg372xp0r29mh7qigkbx1gb3j50nnmcl-zig-0.17.0/bin/zig build-exe --cache-dir .zig-cache --global-cache-dir /nix/var/nix/builds/nix-89629-3170002182/tmp.4SF0FRPWan --build-root . --zig-lib-dir /nix/store/bg372xp0r29mh7qigkbx1gb3j50nnmcl-zig-0.17.0/lib/zig --name configurer -fsingle-threaded --dep @build --dep @dependencies -Mroot=/nix/store/bg372xp0r29mh7qigkbx1gb3j50nnmcl-zig-0.17.0/lib/zig/compiler/configurer.zig -M@dependencies=.zig-cache/o/ce72526ee7fc0580e3a089da327c554a/dependencies.zig -M@build=build.zig --listen=-
failed checks.aarch64-darwin.pkgs-droid 54s
setup: these 2 derivations will be built: /nix/store/lb48liv22zrk22zdvvk6nwypjwnbi3q2-droid-0.249.0.drv /nix/store/i70x4ysrxfhrwmfajkzcc3lrk7cf4jmy-check-dr …
setup:
these 2 derivations will be built:
  /nix/store/lb48liv22zrk22zdvvk6nwypjwnbi3q2-droid-0.249.0.drv
  /nix/store/i70x4ysrxfhrwmfajkzcc3lrk7cf4jmy-check-droid.drv
could not copy /nix/store/mn6x7ld2ijyk3pzs8dyl1cpkqg5w90iz-droid-0.249.0: error: gRPC FetchNars failed: Stream removed (Socket closed)
error: some outputs are unexpectedly invalid
failed checks.aarch64-darwin.pkgs-maki 2m 20s
setup: these 3 derivations will be built: /nix/store/3rizi6sn5ybhc5hpgfshxrivlmims8ab-maki-0.6.5-vendor.drv /nix/store/zrs5a3jpbyn5d74mcn42xcvywfzwv2h5-maki …
setup:
these 3 derivations will be built:
  /nix/store/3rizi6sn5ybhc5hpgfshxrivlmims8ab-maki-0.6.5-vendor.drv
  /nix/store/zrs5a3jpbyn5d74mcn42xcvywfzwv2h5-maki-0.6.5.drv
  /nix/store/1hy9x4x8ggxysb3fa9m2vi9p9sdj46z4-check-maki.drv
could not copy /nix/store/2a471cvbd4xn4g35y6kiz72iw69qycag-maki-0.6.5-vendor: error: gRPC FetchNars failed: Stream removed (sendmsg: Broken pipe (32))
error: some outputs are unexpectedly invalid
failed checks.aarch64-darwin.pkgs-minimax-code 2m 2s
setup: these 3 derivations will be built: /nix/store/4bqy3ymcr44ahbq4cyw9xclfxnlx2qsf-minimax-code-src-with-lock.drv /nix/store/wnh3ga8fky7acvhpybbqivqq5iph …
setup:
these 3 derivations will be built:
  /nix/store/4bqy3ymcr44ahbq4cyw9xclfxnlx2qsf-minimax-code-src-with-lock.drv
  /nix/store/wnh3ga8fky7acvhpybbqivqq5iphq85r-minimax-code-0.6.13.drv
  /nix/store/rnvzks83znikyqzhzrn9ynicsqk2v6kp-check-minimax-code.drv
could not copy /nix/store/fr568g4k54qxlm7c4y255yvs838ff8ma-minimax-code-0.6.13: error: gRPC FetchNars failed: Stream removed (sendmsg: Broken pipe (32))
error: some outputs are unexpectedly invalid
failed checks.aarch64-darwin.pkgs-oh-my-codex 1m 20s
setup: /nix/store/1j7ka7fc8vaflal0sn63v8ix987hzlks-omx-sparkshell-0.21.35-vendor.drv /nix/store/dcr0lw95szp7dvy8qgi8s60pksvzkcbb-omx-sparkshell-0.21.35.drv …
setup:
  /nix/store/1j7ka7fc8vaflal0sn63v8ix987hzlks-omx-sparkshell-0.21.35-vendor.drv
  /nix/store/dcr0lw95szp7dvy8qgi8s60pksvzkcbb-omx-sparkshell-0.21.35.drv
  /nix/store/iaq3v6r39qxv04v60a843mjibvyyw504-omx-explore-harness-0.21.35-vendor.drv
  /nix/store/iy9pgm3x7ipalbs70kw1py6kzp7q89m4-omx-explore-harness-0.21.35.drv
  /nix/store/v189x39shqj8z61bdzpl6d5kpp1y27qw-oh-my-codex-0.21.35.drv
  /nix/store/vf624l2abjszgcpd04zmw8xl41gfp9l9-check-oh-my-codex.drv
could not copy /nix/store/mygc08mfqrxldnjsvs8izjc6hjwln2as-omx-explore-harness-0.21.35: error: gRPC FetchNars failed: failed to connect to all addresses; last error: UNKNOWN: ipv4:127.0.0.2:50051: tcp handshaker shutdown
error: some outputs are unexpectedly invalid
failed checks.aarch64-darwin.pkgs-orbi-cli 4m 49s
orbi-cli-0.7.15: 272 _callImplicitHook /nix/store/4gqzn5ia76rp74p8fb6nvry3arbn3l7j-stdenv-darwin/setup 289 _eval /nix/store/4gqzn5ia76rp74p8fb6nvry3arbn3l7j-std …
orbi-cli-0.7.15:
272 _callImplicitHook /nix/store/4gqzn5ia76rp74p8fb6nvry3arbn3l7j-stdenv-darwin/setup
289 _eval /nix/store/4gqzn5ia76rp74p8fb6nvry3arbn3l7j-stdenv-darwin/setup
228 runHook /nix/store/4gqzn5ia76rp74p8fb6nvry3arbn3l7j-stdenv-darwin/setup
1674 fixupPhase /nix/store/4gqzn5ia76rp74p8fb6nvry3arbn3l7j-stdenv-darwin/setup
1779 runPhase /nix/store/4gqzn5ia76rp74p8fb6nvry3arbn3l7j-stdenv-darwin/setup
1834 genericBuild /nix/store/4gqzn5ia76rp74p8fb6nvry3arbn3l7j-stdenv-darwin/setup
1 source /nix/store/shkw4qm9qcw5sc5n1k5jznc83ny02r39-default-builder.sh
3 main /nix/store/l622p70vy8k5sh7y5wizi5f2mic6ynpg-source-stdenv.sh
failed checks.aarch64-darwin.pkgs-t3code 4m 36s
check-t3code: mac02: building 3xp4xxl3s28ppx86djjp0w3km8kk8zbg-check-t3code.drv
check-t3code:
mac02: building 3xp4xxl3s28ppx86djjp0w3km8kk8zbg-check-t3code.drv
failed checks.aarch64-linux.pkgs-ai-memory 1m 24s
setup: these 3 derivations will be built: /nix/store/pmpirn6jx8kqi21wrrwn1jkam5w69dr1-ai-memory-3.2.2-vendor.drv /nix/store/l0mar85lsp2akfsbp8g5jxfjh8px7n10 …
setup:
these 3 derivations will be built:
  /nix/store/pmpirn6jx8kqi21wrrwn1jkam5w69dr1-ai-memory-3.2.2-vendor.drv
  /nix/store/l0mar85lsp2akfsbp8g5jxfjh8px7n10-ai-memory-3.2.2.drv
  /nix/store/halqbj54h7r8g57i2vhjassxfq3q2avs-check-ai-memory.drv
could not copy /nix/store/67ab2k6wp52gmdz8y9n353c9pv0dirr3-ai-memory-3.2.2-vendor: error: gRPC FetchNars failed: Stream removed (Socket closed)
error: some outputs are unexpectedly invalid
failed checks.aarch64-linux.pkgs-amp 1m 14s
setup: these 2 derivations will be built: /nix/store/rgl3ln8bmmpmmsxi2gb8liiai7y92izg-amp-0.0.1792800065-ga5b55b.drv /nix/store/lz9sqrdl23hldpzvfsvh1cks04i1 …
setup:
these 2 derivations will be built:
  /nix/store/rgl3ln8bmmpmmsxi2gb8liiai7y92izg-amp-0.0.1792800065-ga5b55b.drv
  /nix/store/lz9sqrdl23hldpzvfsvh1cks04i19vmy-check-amp.drv
could not copy /nix/store/3rvpn0kbmkyfsvm6bwnkdxqfn06ap7mr-amp-0.0.1792800065-ga5b55b: error: gRPC FetchNars failed: Stream removed (Socket closed)
error: some outputs are unexpectedly invalid
failed checks.aarch64-linux.pkgs-bb-app 22s
setup: these 3 derivations will be built: /nix/store/rchmf8sw5gjrxfcc7w1p9q4vp3v4xjan-bb-app-src-with-lock.drv /nix/store/p38iqwz63bsr0byr3z7ywz06bnn7bvbg-b …
setup:
these 3 derivations will be built:
  /nix/store/rchmf8sw5gjrxfcc7w1p9q4vp3v4xjan-bb-app-src-with-lock.drv
  /nix/store/p38iqwz63bsr0byr3z7ywz06bnn7bvbg-bb-app-0.47.0.drv
  /nix/store/brhhhlx7ia47dpfiggxvhwzc9c10z658-check-bb-app.drv
could not copy /nix/store/jp5y24b6s7bqykcbn1cbrjmy33l1k5xr-bb-app-src-with-lock: error: gRPC FetchNars failed: failed to connect to all addresses; last error: UNKNOWN: ipv4:65.21.215.17:50051: handshaker shutdown
error: some outputs are unexpectedly invalid
failed checks.aarch64-linux.pkgs-chatgpt 49s
chatgpt-unwrapped-26.1021.22027: /nix/store/qzxwwzl3gxyvwmi0ac1gjqz3ihvx3icj-chatgpt-unwrapped-26.1021.22027/lib/chatgpt/resources/plugins/openai-bundled/plugin …
chatgpt-unwrapped-26.1021.22027:
/nix/store/qzxwwzl3gxyvwmi0ac1gjqz3ihvx3icj-chatgpt-unwrapped-26.1021.22027/lib/chatgpt/resources/plugins/openai-bundled/plugins/latex/scripts/build_private_bundle.sh: interpreter directive changed from "#!/usr/bin/env bash" to "/nix/store/czx7cscpnqqmc9nwmbpnv2zcvck64mmf-bash-5.3p20/bin/bash"
/nix/store/qzxwwzl3gxyvwmi0ac1gjqz3ihvx3icj-chatgpt-unwrapped-26.1021.22027/lib/chatgpt/resources/plugins/openai-bundled/plugins/codex-app-tools/scripts/launch_codex_app_tools_mcp: interpreter directive changed from "#!/bin/sh" to "/nix/store/czx7cscpnqqmc9nwmbpnv2zcvck64mmf-bash-5.3p20/bin/sh"
auto-formatelf: libtss2-esys.so.0 not found, wanted by /nix/store/qzxwwzl3gxyvwmi0ac1gjqz3ihvx3icj-chatgpt-unwrapped-26.1021.22027/lib/chatgpt/resources/native/remote-control-device-key.node
auto-formatelf: libtss2-mu.so.0 not found, wanted by /nix/store/qzxwwzl3gxyvwmi0ac1gjqz3ihvx3icj-chatgpt-unwrapped-26.1021.22027/lib/chatgpt/resources/native/remote-control-device-key.node
auto-formatelf: libtss2-tcti-device.so.0 not found, wanted by /nix/store/qzxwwzl3gxyvwmi0ac1gjqz3ihvx3icj-chatgpt-unwrapped-26.1021.22027/lib/chatgpt/resources/native/remote-control-device-key.node
auto-formatelf: ignoring missing liblog.so wanted by /nix/store/qzxwwzl3gxyvwmi0ac1gjqz3ihvx3icj-chatgpt-unwrapped-26.1021.22027/lib/chatgpt/resources/app.asar.unpacked/node_modules/@worklouder/device-kit-oai/node_modules/@worklouder/wl-device-kit/node_modules/serialport/node_modules/@serialport/bindings-cpp/prebuilds/android-arm64/node.napi.armv8.node
auto-formatelf: ignoring missing libc++_shared.so wanted by /nix/store/qzxwwzl3gxyvwmi0ac1gjqz3ihvx3icj-chatgpt-unwrapped-26.1021.22027/lib/chatgpt/resources/app.asar.unpacked/node_modules/@worklouder/device-kit-oai/node_modules/@worklouder/wl-device-kit/node_modules/serialport/node_modules/@serialport/bindings-cpp/prebuilds/android-arm64/node.napi.armv8.node
auto-formatelf: auto-formatelf could not satisfy all dependencies; add them to --libs or pass --ignore-missing
failed checks.aarch64-linux.pkgs-codex-auth 3m 52s
codex-auth-0.3.1: /nix/store/m1n2vd43b8bapyw2zm66c7jhxazimrvn-zig-0.17.0/lib/zig/std/Build.zig:1:1: note: struct declared here const Build = @This(); ^~~~~ refe …
codex-auth-0.3.1:
/nix/store/m1n2vd43b8bapyw2zm66c7jhxazimrvn-zig-0.17.0/lib/zig/std/Build.zig:1:1: note: struct declared here
const Build = @This();
^~~~~
referenced by:
    runPackageScript [inlined]: /nix/store/m1n2vd43b8bapyw2zm66c7jhxazimrvn-zig-0.17.0/lib/zig/std/Build.zig:2144:50
    main: /nix/store/m1n2vd43b8bapyw2zm66c7jhxazimrvn-zig-0.17.0/lib/zig/compiler/configurer.zig:138:29
    4 reference(s) hidden; use '-freference-trace=6' to see all references
error: command reported 1 compilation errors: /nix/store/m1n2vd43b8bapyw2zm66c7jhxazimrvn-zig-0.17.0/bin/zig build-exe --cache-dir .zig-cache --global-cache-dir /build/tmp.GuMNeFs0aH --build-root . --zig-lib-dir /nix/store/m1n2vd43b8bapyw2zm66c7jhxazimrvn-zig-0.17.0/lib/zig --name configurer -fsingle-threaded --dep @build --dep @dependencies -Mroot=/nix/store/m1n2vd43b8bapyw2zm66c7jhxazimrvn-zig-0.17.0/lib/zig/compiler/configurer.zig -M@dependencies=.zig-cache/o/ce72526ee7fc0580e3a089da327c554a/dependencies.zig -M@build=build.zig --listen=-
failed checks.aarch64-linux.pkgs-dolt 51s
check-dolt: elastic-arm-5d407235: building m4sx2gajcipxqfvs43ys287n7rqqdh7j-check-dolt.drv
check-dolt:
elastic-arm-5d407235: building m4sx2gajcipxqfvs43ys287n7rqqdh7j-check-dolt.drv
failed checks.aarch64-linux.pkgs-flake-inputs 22s
setup: these 2 derivations will be built: /nix/store/dx2cyyh0v0fcz0giw7n0k77i9ka5qaz4-flake-inputs.drv /nix/store/05safx1kbmk2x7v8rj42l7ayz9xj3q84-check-fla …
setup:
these 2 derivations will be built:
  /nix/store/dx2cyyh0v0fcz0giw7n0k77i9ka5qaz4-flake-inputs.drv
  /nix/store/05safx1kbmk2x7v8rj42l7ayz9xj3q84-check-flake-inputs.drv
could not copy /nix/store/jprwp5p53pzqw36a0likb2fl408r3pga-flake-inputs: error: gRPC FetchNars failed: failed to connect to all addresses; last error: UNKNOWN: ipv4:65.21.215.17:50051: tcp handshaker shutdown
error: some outputs are unexpectedly invalid
failed checks.aarch64-linux.pkgs-kimi-code 3m 8s
setup: these 2 derivations will be built: /nix/store/9y1fra7rd4yh5krrpr8g736ic4m8lpyf-kimi-code-2.3.1.drv /nix/store/msg5dpl882nr8mnpm7kw3cdv45igv6kn-check- …
setup:
these 2 derivations will be built:
  /nix/store/9y1fra7rd4yh5krrpr8g736ic4m8lpyf-kimi-code-2.3.1.drv
  /nix/store/msg5dpl882nr8mnpm7kw3cdv45igv6kn-check-kimi-code.drv
could not copy /nix/store/gsqg0mk1167lb4mww78g2xm09fz11584-kimi-code-2.3.1: error: gRPC FetchNars failed: failed to connect to all addresses; last error: UNKNOWN: ipv4:127.0.0.2:50051: handshaker shutdown
error: some outputs are unexpectedly invalid
failed checks.aarch64-linux.pkgs-minimax-code 8m 27s
setup: these 3 derivations will be built: /nix/store/jy2vcxjdfapwzr6hwfrb8fnnvfmvw1xj-minimax-code-src-with-lock.drv /nix/store/rs3by06lirnxjgvzdzrn5bffb4mh …
setup:
these 3 derivations will be built:
  /nix/store/jy2vcxjdfapwzr6hwfrb8fnnvfmvw1xj-minimax-code-src-with-lock.drv
  /nix/store/rs3by06lirnxjgvzdzrn5bffb4mhr3rw-minimax-code-0.6.13.drv
  /nix/store/mynjwypi7g4xpl4bspvgh3ccwrrqmxvl-check-minimax-code.drv
could not copy /nix/store/31gkm9d97x4mzm8wg3rwm1x28v5w307b-minimax-code-0.6.13: error: gRPC FetchNars failed: Stream removed (Socket closed)
error: some outputs are unexpectedly invalid
failed checks.aarch64-linux.pkgs-oh-my-codex 5m 3s
check-oh-my-codex: elastic-arm-5d407235: building sdijs9vvkz0nzknff68d7h2ms53dj60w-check-oh-my-codex.drv
check-oh-my-codex:
elastic-arm-5d407235: building sdijs9vvkz0nzknff68d7h2ms53dj60w-check-oh-my-codex.drv
failed checks.aarch64-linux.pkgs-orbi-cli 14s
orbi-cli-0.7.15: 264 _callImplicitHook /nix/store/49cnv1lz3hiybz55z8lm8i401iqrpqyw-stdenv-linux/setup 281 _eval /nix/store/49cnv1lz3hiybz55z8lm8i401iqrpqyw-stde …
orbi-cli-0.7.15:
264 _callImplicitHook /nix/store/49cnv1lz3hiybz55z8lm8i401iqrpqyw-stdenv-linux/setup
281 _eval /nix/store/49cnv1lz3hiybz55z8lm8i401iqrpqyw-stdenv-linux/setup
220 runHook /nix/store/49cnv1lz3hiybz55z8lm8i401iqrpqyw-stdenv-linux/setup
1666 fixupPhase /nix/store/49cnv1lz3hiybz55z8lm8i401iqrpqyw-stdenv-linux/setup
1771 runPhase /nix/store/49cnv1lz3hiybz55z8lm8i401iqrpqyw-stdenv-linux/setup
1826 genericBuild /nix/store/49cnv1lz3hiybz55z8lm8i401iqrpqyw-stdenv-linux/setup
1 source /nix/store/shkw4qm9qcw5sc5n1k5jznc83ny02r39-default-builder.sh
3 main /nix/store/l622p70vy8k5sh7y5wizi5f2mic6ynpg-source-stdenv.sh
failed checks.aarch64-linux.pkgs-t3code 14m 17s
setup: these 2 derivations will be built: /nix/store/9h73wxn647d6ik0vqdhyfb0x6zgm8yxq-t3code-0.1.2.drv /nix/store/krr78c5y5nb2x48vp4spf9ndivgwyy1n-check-t3c …
setup:
these 2 derivations will be built:
  /nix/store/9h73wxn647d6ik0vqdhyfb0x6zgm8yxq-t3code-0.1.2.drv
  /nix/store/krr78c5y5nb2x48vp4spf9ndivgwyy1n-check-t3code.drv
this path will be fetched (0.0 KiB download, 293.3 MiB unpacked):
  /nix/store/fcfjj0q282s1i6mkkkhcmj536ymbh1x2-t3code-0.1.2-desktop
could not copy /nix/store/asi5kinixnxki5gar8xcddsy3a6jwlgg-t3code-0.1.2-desktop: error: gRPC FetchNars failed: failed to connect to all addresses; last error: UNKNOWN: ipv4:65.21.215.17:50051: handshaker shutdown
error: some outputs are unexpectedly invalid
failed checks.aarch64-linux.pkgs-t3code-desktop 12m 32s
setup: /nix/store/4paciqbc9clpqkpsb2raky29c2hhdxpx-t3code-resource-monitor-0.1.2-vendor.drv /nix/store/vwsqip5xn8y97j3l8aw71zdw1cfkh3lc-t3code-resource-moni …
setup:
  /nix/store/4paciqbc9clpqkpsb2raky29c2hhdxpx-t3code-resource-monitor-0.1.2-vendor.drv
  /nix/store/vwsqip5xn8y97j3l8aw71zdw1cfkh3lc-t3code-resource-monitor-0.1.2.drv
  /nix/store/f4xam2760n4l9fxymcqnlkl715lvam06-t3code-0.1.2.drv
  /nix/store/9h73wxn647d6ik0vqdhyfb0x6zgm8yxq-t3code-0.1.2.drv
  /nix/store/l5hdj7c6l20sx1j9cjj9v1db1dmg3nyj-t3code-desktop.drv
  /nix/store/3045i5b7f8lq7nm6ag131s3p0s8zlzm8-check-t3code-desktop.drv
could not copy /nix/store/fcfjj0q282s1i6mkkkhcmj536ymbh1x2-t3code-0.1.2-desktop: error: gRPC FetchNars failed: Stream removed (Socket closed)
error: some outputs are unexpectedly invalid
failed checks.x86_64-linux.pkgs-ai-memory 39m 20s
setup: don't know how to build these paths: /nix/store/gx0wqf8vgrz2q3zznb76h3an7kxqx13y-check-ai-memory.drv warning: ignoring the client-specified setting 'st …
setup:
don't know how to build these paths:
  /nix/store/gx0wqf8vgrz2q3zznb76h3an7kxqx13y-check-ai-memory.drv
warning: ignoring the client-specified setting 'store', because it is a restricted setting and you are not a trusted user
error: dependency 'h2cjjsdsn6d8nr4pyni8n793yaffxj8v-ai-memory-3.2.2.drv' failed
failed checks.x86_64-linux.pkgs-chatgpt 1m 47s
setup: don't know how to build these paths: /nix/store/d9fl4mbw6m3y7ncn5yq9dm51zcy02n1k-check-chatgpt.drv warning: ignoring the client-specified setting 'stor …
setup:
don't know how to build these paths:
  /nix/store/d9fl4mbw6m3y7ncn5yq9dm51zcy02n1k-check-chatgpt.drv
warning: ignoring the client-specified setting 'store', because it is a restricted setting and you are not a trusted user
error: dependency 'b8xv3rh0nyxygmkfpwr9lskr0bvz85vf-chatgpt-26.1021.22027.drv' failed
failed checks.x86_64-linux.pkgs-codex-auth 14m 51s
setup: don't know how to build these paths: /nix/store/ialca1fk3jzfdsgzxkih29xlwsy57njj-check-codex-auth.drv warning: ignoring the client-specified setting 's …
setup:
don't know how to build these paths:
  /nix/store/ialca1fk3jzfdsgzxkih29xlwsy57njj-check-codex-auth.drv
warning: ignoring the client-specified setting 'store', because it is a restricted setting and you are not a trusted user
error: dependency 'yk3j1c7fgy75q6bjx5q3hndpyi0p474p-codex-auth-0.3.1.drv' failed
failed checks.x86_64-linux.pkgs-orbi-cli 30s
setup: /nix/store/pc1dqk146y69xrd4zphjhk062jsb5qys-check-orbi-cli.drv these 4 paths will be fetched (0.0 KiB download, 142.7 MiB unpacked): /nix/store/zf8q6 …
setup:
  /nix/store/pc1dqk146y69xrd4zphjhk062jsb5qys-check-orbi-cli.drv
these 4 paths will be fetched (0.0 KiB download, 142.7 MiB unpacked):
  /nix/store/zf8q69vrdflm3v09wi0ngsgbmj2q1gid-gh-2.102.0
  /nix/store/56n8ayk9jd7mb2n7wyfr8r8vi14ccdwx-orbi_cli-0.7.15.tar.gz
  /nix/store/l2yv90qlxk95xfpk385b0zphs4pwn9sc-pi-1.4.0
  /nix/store/amc08awcxvz178lqqc0y5n568ch1bzxg-version-check-hook
warning: ignoring the client-specified setting 'store', because it is a restricted setting and you are not a trusted user
error: dependency 'p39ks5rf1gr5vvyjz89br8nks7gar2ri-orbi-cli-0.7.15.drv' failed
failed checks.x86_64-linux.pkgs-workmux 26m 35s
setup: don't know how to build these paths: /nix/store/2677d1avg7xa8g8bqyr8njc5iccps6da-check-workmux.drv warning: ignoring the client-specified setting 'stor …
setup:
don't know how to build these paths:
  /nix/store/2677d1avg7xa8g8bqyr8njc5iccps6da-check-workmux.drv
warning: ignoring the client-specified setting 'store', because it is a restricted setting and you are not a trusted user
error: dependency 'rpnqa5h3j5dvkl2gvw9ls76kgk1x773h-workmux-0.1.277.drv' failed
127 succeeded
succeeded attributes
status attribute duration
loading…
539 already built
skipped attributes
status attribute duration
loading…