numtide/llm-agents.nix build #8958 failed ← #8957 #8959 →
eval warnings
2 kinds
· 2 occurrences
- warn setting 'accept-flake-config' is ignored: iets never applies a flake's nixConfig, so a flake that sets extra-substituters or allow-import-from-derivation there runs without them; put the settings in nix.conf ×1
- warn setting 'plugin-files' is ignored: iets loads no plugins ×1
3 failed
| status | attribute | duration |
|---|---|---|
checks.aarch64-darwin.pkgs-plannotator
|
5m 49s | |
plannotator-0.28.30: error: @tailwindcss/vite@4.3.3 failed to resolve error: @types/react@19.2.18 failed to resolve error: @types/react-dom@19.2.7 failed to res …plannotator-0.28.30: error: @tailwindcss/vite@4.3.3 failed to resolve error: @types/react@19.2.18 failed to resolve error: @types/react-dom@19.2.7 failed to resolve error: @vitejs/plugin-react@5.2.0 failed to resolve error: vite@6.4.3 failed to resolve error: wrangler@4.129.0 failed to resolve error: react@19.2.8 failed to resolve error: react-dom@19.2.8 failed to resolve |
||
checks.aarch64-linux.pkgs-plannotator
|
1m 56s | |
plannotator-0.28.30: error: @tailwindcss/vite@4.3.3 failed to resolve error: @types/react@19.2.18 failed to resolve error: @types/react-dom@19.2.7 failed to res …plannotator-0.28.30: error: @tailwindcss/vite@4.3.3 failed to resolve error: @types/react@19.2.18 failed to resolve error: @types/react-dom@19.2.7 failed to resolve error: @vitejs/plugin-react@5.2.0 failed to resolve error: vite@6.4.3 failed to resolve error: wrangler@4.129.0 failed to resolve error: react@19.2.8 failed to resolve error: react-dom@19.2.8 failed to resolve |
||
checks.x86_64-linux.pkgs-plannotator
|
6m 58s | |
setup: don't know how to build these paths: /nix/store/gpyy457870lb4b4l6k3x2kv3r31jgcnq-check-plannotator.drv warning: ignoring the client-specified setting ' …setup: don't know how to build these paths: /nix/store/gpyy457870lb4b4l6k3x2kv3r31jgcnq-check-plannotator.drv warning: ignoring the client-specified setting 'store', because it is a restricted setting and you are not a trusted user error: dependency 'x53vsxqff720g9nhgmm2fz0xh1kgkg2j-plannotator-0.28.30.drv' failed |
||
13 succeeded
| status | attribute | duration |
|---|---|---|
| loading… | ||
678 already built
| status | attribute | duration |
|---|---|---|
| loading… | ||