don't know how to build these paths: /nix/store/s2s5207j55p4bjhwpbf1iysvffyk07fl-check-t3code-desktop.drv warning: ignoring the client-specified setting 'store', because it is a restricted setting and you are not a trusted user building '/nix/store/i7ycw5kc4j3ki9sy6lsp53q3hy4dmc7s-codex-0.164.0.drv' on farm.numtide.com:50051 codex-0.164.0> attached to the build already running on this worker codex-0.164.0> bld1: building i7ycw5kc4j3ki9sy6lsp53q3hy4dmc7s-codex-0.164.0.drv codex-0.164.0> Using versionCheckHook codex-0.164.0> Running phase: unpackPhase codex-0.164.0> unpacking source archive /nix/store/10pdz4z8bfg35ysd7aqrhnzdkijpmmwb-source codex-0.164.0> source root is source/codex-rs codex-0.164.0> Executing cargoSetupPostUnpackHook codex-0.164.0> Finished cargoSetupPostUnpackHook codex-0.164.0> unpackPhase completed in 2 minutes 31 seconds codex-0.164.0> Running phase: patchPhase codex-0.164.0> applying patch /nix/store/yl1g5zgms31fd33ayqwzra3l9djcpkjm-daemon-nix-store.patch codex-0.164.0> patching file app-server-daemon/src/prepare_install.rs codex-0.164.0> Hunk #1 succeeded at 78 (offset 2 lines). codex-0.164.0> Hunk #2 succeeded at 112 (offset 2 lines). codex-0.164.0> Hunk #3 succeeded at 233 (offset 6 lines). codex-0.164.0> Hunk #4 FAILED at 276. codex-0.164.0> Hunk #5 FAILED at 350. codex-0.164.0> 2 out of 5 hunks FAILED -- saving rejects to file app-server-daemon/src/prepare_install.rs.rej error: dependency 'rvlcqr44hsh7s4gcpx8lvjkibl9m315m-t3code-desktop.drv' failed