bld1: building i7ycw5kc4j3ki9sy6lsp53q3hy4dmc7s-codex-0.164.0.drv Using versionCheckHook Running phase: unpackPhase unpacking source archive /nix/store/10pdz4z8bfg35ysd7aqrhnzdkijpmmwb-source source root is source/codex-rs Executing cargoSetupPostUnpackHook Finished cargoSetupPostUnpackHook unpackPhase completed in 2 minutes 31 seconds Running phase: patchPhase applying patch /nix/store/yl1g5zgms31fd33ayqwzra3l9djcpkjm-daemon-nix-store.patch patching file app-server-daemon/src/prepare_install.rs Hunk #1 succeeded at 78 (offset 2 lines). Hunk #2 succeeded at 112 (offset 2 lines). Hunk #3 succeeded at 233 (offset 6 lines). Hunk #4 FAILED at 276. Hunk #5 FAILED at 350. 2 out of 5 hunks FAILED -- saving rejects to file app-server-daemon/src/prepare_install.rs.rej