nixbot

builds

numtide/llm-agents.nix build #8413 failed

branch main · PR #11085 · commit 04c73af12f · · took 2h 8m · eval 3m 59s

eval warnings 2 kinds · 2 occurrences
  • warn setting 'accept-flake-config' is ignored: iets never applies a flake's nixConfig, so a flake that sets extra-substituters or allow-import-from-derivation there runs without them; put the settings in nix.conf ×1
  • warn setting 'plugin-files' is ignored: iets loads no plugins ×1

29 failed
failed attributes
status attribute duration
failed checks.aarch64-darwin.pkgs-ai-memory 6m 13s
setup: these 3 derivations will be built: /nix/store/1lagfylc22rs31rmq14izm928wkj6f64-ai-memory-3.1.2-vendor.drv /nix/store/h7xn508hpivk7g8lj2iz5gb7g2p4v26h …
setup:
these 3 derivations will be built:
  /nix/store/1lagfylc22rs31rmq14izm928wkj6f64-ai-memory-3.1.2-vendor.drv
  /nix/store/h7xn508hpivk7g8lj2iz5gb7g2p4v26h-ai-memory-3.1.2.drv
  /nix/store/k20253hzhm53gsz5ac16vaz7i88ny6q9-check-ai-memory.drv
could not copy /nix/store/k4r4j4fxll8mlzhqn3fypam3386hckqz-ai-memory-3.1.2-vendor: error: gRPC FetchNars failed: Stream removed (Socket closed)
error: some outputs are unexpectedly invalid
failed checks.aarch64-darwin.pkgs-apm 1m 6s
apm-0.34.0: adding 'apm_cli-0.34.0.dist-info/RECORD' removing build/bdist.macosx-14.0-arm64/wheel Successfully built apm_cli-0.34.0-py3-none-any.whl Finished cr …
apm-0.34.0:
adding 'apm_cli-0.34.0.dist-info/RECORD'
removing build/bdist.macosx-14.0-arm64/wheel
Successfully built apm_cli-0.34.0-py3-none-any.whl
Finished creating a wheel...
Finished executing pypaBuildPhase
Executing pythonRuntimeDepsCheck
Checking runtime dependencies for apm_cli-0.34.0-py3-none-any.whl
  - websockets<17,>=12 not satisfied by version 17.0.1
failed checks.aarch64-darwin.pkgs-chatgpt 6m 36s
setup: these 3 derivations will be built: /nix/store/9zr4i1k23r8gp4774fs3n3ywab72da3p-chatgpt-unwrapped-26.1016.51333.drv /nix/store/ld88a0yv1x0xcrcn8al5s0q …
setup:
these 3 derivations will be built:
  /nix/store/9zr4i1k23r8gp4774fs3n3ywab72da3p-chatgpt-unwrapped-26.1016.51333.drv
  /nix/store/ld88a0yv1x0xcrcn8al5s0qr8isi31l8-chatgpt-26.1016.51333.drv
  /nix/store/6dhrwbi0jlh9k2dvpxriyiflqxffvhwz-check-chatgpt.drv
could not copy /nix/store/xzwvrlmf9468zmriqrfprifv2dhikdah-chatgpt-unwrapped-26.1016.51333: error: gRPC FetchNars failed: Stream removed (sendmsg: Broken pipe (32))
error: some outputs are unexpectedly invalid
failed checks.aarch64-darwin.pkgs-hermes-agent 13m 32s
hermes-agent-0.22.2: Unpacking to: unpacked/hermes_agent-0.0.0...OK Repacking wheel as ./hermes_agent-0.0.0-py3-none-any.whl...OK /nix/var/nix/builds/nix-71987- …
hermes-agent-0.22.2:
Unpacking to: unpacked/hermes_agent-0.0.0...OK
Repacking wheel as ./hermes_agent-0.0.0-py3-none-any.whl...OK
/nix/var/nix/builds/nix-71987-1208837631/source
Finished executing pypaBuildPhase
Executing pythonRuntimeDepsCheck
Checking runtime dependencies for hermes_agent-0.0.0-py3-none-any.whl
  - prompt-toolkit==3.0.52 not satisfied by version 3.0.53
  - markdown==3.10.2 not satisfied by version 3.10.3
failed checks.aarch64-darwin.pkgs-hermes-desktop 12m 32s
hermes-agent-0.22.2: Unpacking to: unpacked/hermes_agent-0.0.0...OK Repacking wheel as ./hermes_agent-0.0.0-py3-none-any.whl...OK /nix/var/nix/builds/nix-72120- …
hermes-agent-0.22.2:
Unpacking to: unpacked/hermes_agent-0.0.0...OK
Repacking wheel as ./hermes_agent-0.0.0-py3-none-any.whl...OK
/nix/var/nix/builds/nix-72120-249756706/source
Finished executing pypaBuildPhase
Executing pythonRuntimeDepsCheck
Checking runtime dependencies for hermes_agent-0.0.0-py3-none-any.whl
  - prompt-toolkit==3.0.52 not satisfied by version 3.0.53
  - markdown==3.10.2 not satisfied by version 3.10.3
failed checks.aarch64-darwin.pkgs-orbi-cli 12m 37s
orbi-cli-0.7.12: 272 _callImplicitHook /nix/store/4gqzn5ia76rp74p8fb6nvry3arbn3l7j-stdenv-darwin/setup 289 _eval /nix/store/4gqzn5ia76rp74p8fb6nvry3arbn3l7j-std …
orbi-cli-0.7.12:
272 _callImplicitHook /nix/store/4gqzn5ia76rp74p8fb6nvry3arbn3l7j-stdenv-darwin/setup
289 _eval /nix/store/4gqzn5ia76rp74p8fb6nvry3arbn3l7j-stdenv-darwin/setup
228 runHook /nix/store/4gqzn5ia76rp74p8fb6nvry3arbn3l7j-stdenv-darwin/setup
1674 fixupPhase /nix/store/4gqzn5ia76rp74p8fb6nvry3arbn3l7j-stdenv-darwin/setup
1779 runPhase /nix/store/4gqzn5ia76rp74p8fb6nvry3arbn3l7j-stdenv-darwin/setup
1834 genericBuild /nix/store/4gqzn5ia76rp74p8fb6nvry3arbn3l7j-stdenv-darwin/setup
1 source /nix/store/shkw4qm9qcw5sc5n1k5jznc83ny02r39-default-builder.sh
3 main /nix/store/l622p70vy8k5sh7y5wizi5f2mic6ynpg-source-stdenv.sh
failed checks.aarch64-linux.pkgs-apm 20s
apm-0.34.0: adding 'apm_cli-0.34.0.dist-info/RECORD' removing build/bdist.linux-aarch64/wheel Successfully built apm_cli-0.34.0-py3-none-any.whl Finished creati …
apm-0.34.0:
adding 'apm_cli-0.34.0.dist-info/RECORD'
removing build/bdist.linux-aarch64/wheel
Successfully built apm_cli-0.34.0-py3-none-any.whl
Finished creating a wheel...
Finished executing pypaBuildPhase
Executing pythonRuntimeDepsCheck
Checking runtime dependencies for apm_cli-0.34.0-py3-none-any.whl
  - websockets<17,>=12 not satisfied by version 17.0.1
failed checks.aarch64-linux.pkgs-chatgpt 41s
chatgpt-unwrapped-26.1016.51333: /nix/store/7f1sn62k008kl9wlw9ckjzmycy45dzlf-chatgpt-unwrapped-26.1016.51333/lib/chatgpt/resources/cua_node/bin/corepack: interp …
chatgpt-unwrapped-26.1016.51333:
/nix/store/7f1sn62k008kl9wlw9ckjzmycy45dzlf-chatgpt-unwrapped-26.1016.51333/lib/chatgpt/resources/cua_node/bin/corepack: interpreter directive changed from "#!/usr/bin/env sh" to "/nix/store/czx7cscpnqqmc9nwmbpnv2zcvck64mmf-bash-5.3p20/bin/sh"
/nix/store/7f1sn62k008kl9wlw9ckjzmycy45dzlf-chatgpt-unwrapped-26.1016.51333/lib/chatgpt/codex-launcher: interpreter directive changed from "#!/bin/sh" to "/nix/store/czx7cscpnqqmc9nwmbpnv2zcvck64mmf-bash-5.3p20/bin/sh"
auto-formatelf: libtss2-esys.so.0 not found, wanted by /nix/store/7f1sn62k008kl9wlw9ckjzmycy45dzlf-chatgpt-unwrapped-26.1016.51333/lib/chatgpt/resources/native/remote-control-device-key.node
auto-formatelf: libtss2-mu.so.0 not found, wanted by /nix/store/7f1sn62k008kl9wlw9ckjzmycy45dzlf-chatgpt-unwrapped-26.1016.51333/lib/chatgpt/resources/native/remote-control-device-key.node
auto-formatelf: libtss2-tcti-device.so.0 not found, wanted by /nix/store/7f1sn62k008kl9wlw9ckjzmycy45dzlf-chatgpt-unwrapped-26.1016.51333/lib/chatgpt/resources/native/remote-control-device-key.node
auto-formatelf: ignoring missing liblog.so wanted by /nix/store/7f1sn62k008kl9wlw9ckjzmycy45dzlf-chatgpt-unwrapped-26.1016.51333/lib/chatgpt/resources/app.asar.unpacked/node_modules/@worklouder/device-kit-oai/node_modules/@worklouder/wl-device-kit/node_modules/serialport/node_modules/@serialport/bindings-cpp/prebuilds/android-arm64/node.napi.armv8.node
auto-formatelf: ignoring missing libc++_shared.so wanted by /nix/store/7f1sn62k008kl9wlw9ckjzmycy45dzlf-chatgpt-unwrapped-26.1016.51333/lib/chatgpt/resources/app.asar.unpacked/node_modules/@worklouder/device-kit-oai/node_modules/@worklouder/wl-device-kit/node_modules/serialport/node_modules/@serialport/bindings-cpp/prebuilds/android-arm64/node.napi.armv8.node
auto-formatelf: auto-formatelf could not satisfy all dependencies; add them to --libs or pass --ignore-missing
failed checks.aarch64-linux.pkgs-cli-proxy-api 4m 34s
check-cli-proxy-api: elastic-arm-cb9b0b2d: building s9bqczqcy3bci7fgnfik9kkqmzp2flpf-check-cli-proxy-api.drv
check-cli-proxy-api:
elastic-arm-cb9b0b2d: building s9bqczqcy3bci7fgnfik9kkqmzp2flpf-check-cli-proxy-api.drv
failed checks.aarch64-linux.pkgs-copilot-cli 10s
copilot-cli-1.0.101: unpacking source archive /nix/store/dxrpp3inldkksw13n3wcvfpf1gl9i1rp-copilot-linux-arm64-1.0.101.tgz source root is package setting SOURCE_ …
copilot-cli-1.0.101:
unpacking source archive /nix/store/dxrpp3inldkksw13n3wcvfpf1gl9i1rp-copilot-linux-arm64-1.0.101.tgz
source root is package
setting SOURCE_DATE_EPOCH to timestamp 499162500 of file "package/package.json"
no configure script, doing nothing
checking for references to /build/ in /nix/store/jkvd9w2yc8rswh67qjfbhmffyzj6whwk-copilot-cli-1.0.101...
patching script interpreter paths in /nix/store/jkvd9w2yc8rswh67qjfbhmffyzj6whwk-copilot-cli-1.0.101
Executing versionCheckPhase
Did not find version 1.0.101 in the output of the command /nix/store/jkvd9w2yc8rswh67qjfbhmffyzj6whwk-copilot-cli-1.0.101/bin/copilot --version
failed checks.aarch64-linux.pkgs-hermes-agent 21s
hermes-agent-0.22.2: Unpacking to: unpacked/hermes_agent-0.0.0...OK Repacking wheel as ./hermes_agent-0.0.0-py3-none-any.whl...OK /build/source Finished executi …
hermes-agent-0.22.2:
Unpacking to: unpacked/hermes_agent-0.0.0...OK
Repacking wheel as ./hermes_agent-0.0.0-py3-none-any.whl...OK
/build/source
Finished executing pypaBuildPhase
Executing pythonRuntimeDepsCheck
Checking runtime dependencies for hermes_agent-0.0.0-py3-none-any.whl
  - prompt-toolkit==3.0.52 not satisfied by version 3.0.53
  - markdown==3.10.2 not satisfied by version 3.10.3
failed checks.aarch64-linux.pkgs-hermes-desktop 15m 49s
hermes-agent-0.22.2: Unpacking to: unpacked/hermes_agent-0.0.0...OK Repacking wheel as ./hermes_agent-0.0.0-py3-none-any.whl...OK /build/source Finished executi …
hermes-agent-0.22.2:
Unpacking to: unpacked/hermes_agent-0.0.0...OK
Repacking wheel as ./hermes_agent-0.0.0-py3-none-any.whl...OK
/build/source
Finished executing pypaBuildPhase
Executing pythonRuntimeDepsCheck
Checking runtime dependencies for hermes_agent-0.0.0-py3-none-any.whl
  - prompt-toolkit==3.0.52 not satisfied by version 3.0.53
  - markdown==3.10.2 not satisfied by version 3.10.3
failed checks.aarch64-linux.pkgs-orbi-cli 12s
orbi-cli-0.7.12: 264 _callImplicitHook /nix/store/49cnv1lz3hiybz55z8lm8i401iqrpqyw-stdenv-linux/setup 281 _eval /nix/store/49cnv1lz3hiybz55z8lm8i401iqrpqyw-stde …
orbi-cli-0.7.12:
264 _callImplicitHook /nix/store/49cnv1lz3hiybz55z8lm8i401iqrpqyw-stdenv-linux/setup
281 _eval /nix/store/49cnv1lz3hiybz55z8lm8i401iqrpqyw-stdenv-linux/setup
220 runHook /nix/store/49cnv1lz3hiybz55z8lm8i401iqrpqyw-stdenv-linux/setup
1666 fixupPhase /nix/store/49cnv1lz3hiybz55z8lm8i401iqrpqyw-stdenv-linux/setup
1771 runPhase /nix/store/49cnv1lz3hiybz55z8lm8i401iqrpqyw-stdenv-linux/setup
1826 genericBuild /nix/store/49cnv1lz3hiybz55z8lm8i401iqrpqyw-stdenv-linux/setup
1 source /nix/store/shkw4qm9qcw5sc5n1k5jznc83ny02r39-default-builder.sh
3 main /nix/store/l622p70vy8k5sh7y5wizi5f2mic6ynpg-source-stdenv.sh
failed checks.aarch64-linux.pkgs-orca 2m 6s
setup: these 2 derivations will be built: /nix/store/a2rm4yi0ibvj56phq3ardhzrf1yhhhw1-orca-1.4.233.drv /nix/store/qq74mp77hb3kw3xz3083nb7xkp299ha3-check-orc …
setup:
these 2 derivations will be built:
  /nix/store/a2rm4yi0ibvj56phq3ardhzrf1yhhhw1-orca-1.4.233.drv
  /nix/store/qq74mp77hb3kw3xz3083nb7xkp299ha3-check-orca.drv
could not copy /nix/store/jsmx503w4y24qi7bpjp23f5gfhw7ynzm-orca-1.4.233: error: gRPC FetchNars failed: Stream removed (sendmsg: Broken pipe (32))
error: some outputs are unexpectedly invalid
failed checks.aarch64-linux.pkgs-qoder-cli-cn 32s
setup: these 2 derivations will be built: /nix/store/m41c6cg6gda6387yqmwnxjjxcvzjblj0-qoder-cli-cn-1.1.75.drv /nix/store/209zh8qkjmnadbiydnb7md6pbahmj5yb-ch …
setup:
these 2 derivations will be built:
  /nix/store/m41c6cg6gda6387yqmwnxjjxcvzjblj0-qoder-cli-cn-1.1.75.drv
  /nix/store/209zh8qkjmnadbiydnb7md6pbahmj5yb-check-qoder-cli-cn.drv
could not copy /nix/store/zrgv3rgr4srqv2ppjmy4zksc75b1y66b-qoder-cli-cn-1.1.75: error: gRPC FetchNars failed: Stream removed (sendmsg: Broken pipe (32))
error: some outputs are unexpectedly invalid
failed checks.aarch64-linux.pkgs-t3code 16s
check-t3code: elastic-arm-cb9b0b2d: building j5k7zwkw587ajs2mkhnfr0zvgp0rqc8s-check-t3code.drv
check-t3code:
elastic-arm-cb9b0b2d: building j5k7zwkw587ajs2mkhnfr0zvgp0rqc8s-check-t3code.drv
failed checks.x86_64-linux.pkgs-agent-browser 23m 13s
setup: these 2 derivations will be built: /nix/store/cspha4rdzhj2nvj242fi53aai5p28zm8-agent-browser-0.39.1.drv /nix/store/ddmskmrbhjj88gmlhkj4xhninz6shq04-c …
setup:
these 2 derivations will be built:
  /nix/store/cspha4rdzhj2nvj242fi53aai5p28zm8-agent-browser-0.39.1.drv
  /nix/store/ddmskmrbhjj88gmlhkj4xhninz6shq04-check-agent-browser.drv
error: timed out after 1200 seconds
error: Cannot build '/nix/store/ddmskmrbhjj88gmlhkj4xhninz6shq04-check-agent-browser.drv'.
       Reason: 1 dependency failed.
       Output paths:
         /nix/store/gyikqik70gbnl54wcxblxz2vds1qmna1-check-agent-browser
failed checks.x86_64-linux.pkgs-ai-memory 39m 36s
setup: these 3 derivations will be built: /nix/store/7biprv3j00rpcw0gc2v9v1irdsmx9rnm-ai-memory-3.1.2-vendor.drv /nix/store/z4kk37v8z1xmz133khvfjazwrmzhhlr0 …
setup:
these 3 derivations will be built:
  /nix/store/7biprv3j00rpcw0gc2v9v1irdsmx9rnm-ai-memory-3.1.2-vendor.drv
  /nix/store/z4kk37v8z1xmz133khvfjazwrmzhhlr0-ai-memory-3.1.2.drv
  /nix/store/8a2p6wn0k0ag4dm4ccn517mpfsmc8rsp-check-ai-memory.drv
error: timed out after 1200 seconds
error: Cannot build '/nix/store/8a2p6wn0k0ag4dm4ccn517mpfsmc8rsp-check-ai-memory.drv'.
       Reason: 1 dependency failed.
       Output paths:
         /nix/store/i7b75jkf41hxb11543kp27mvri8jg7sx-check-ai-memory
failed checks.x86_64-linux.pkgs-apm 20s
apm-0.34.0: adding 'apm_cli-0.34.0.dist-info/RECORD' removing build/bdist.linux-x86_64/wheel Successfully built apm_cli-0.34.0-py3-none-any.whl Finished creatin …
apm-0.34.0:
adding 'apm_cli-0.34.0.dist-info/RECORD'
removing build/bdist.linux-x86_64/wheel
Successfully built apm_cli-0.34.0-py3-none-any.whl
Finished creating a wheel...
Finished executing pypaBuildPhase
Executing pythonRuntimeDepsCheck
Checking runtime dependencies for apm_cli-0.34.0-py3-none-any.whl
  - websockets<17,>=12 not satisfied by version 17.0.1
failed checks.x86_64-linux.pkgs-aven 36m 15s
setup: these 2 derivations will be built: /nix/store/7kl6kd77s1qydvw47y6m98jdf8gjlmkj-aven-0.1.50.drv /nix/store/ca4lskiky8c71i4b4r0720wnhyzx1c9h-check-aven …
setup:
these 2 derivations will be built:
  /nix/store/7kl6kd77s1qydvw47y6m98jdf8gjlmkj-aven-0.1.50.drv
  /nix/store/ca4lskiky8c71i4b4r0720wnhyzx1c9h-check-aven.drv
error: timed out after 1200 seconds
error: Cannot build '/nix/store/ca4lskiky8c71i4b4r0720wnhyzx1c9h-check-aven.drv'.
       Reason: 1 dependency failed.
       Output paths:
         /nix/store/qjc7igdbd6v2xf41w3kybm0vp8madzyy-check-aven
failed checks.x86_64-linux.pkgs-chatgpt 1m 45s
chatgpt-unwrapped-26.1016.51333: /nix/store/vfa145smh7h5szg068jw03ghpndx58m5-chatgpt-unwrapped-26.1016.51333/lib/chatgpt/codex-launcher: interpreter directive c …
chatgpt-unwrapped-26.1016.51333:
/nix/store/vfa145smh7h5szg068jw03ghpndx58m5-chatgpt-unwrapped-26.1016.51333/lib/chatgpt/codex-launcher: interpreter directive changed from "#!/bin/sh" to "/nix/store/nnm9gdr70ihc6zc9298mzz8jpcgaciql-bash-5.3p20/bin/sh"
auto-formatelf: libtss2-esys.so.0 not found, wanted by /nix/store/vfa145smh7h5szg068jw03ghpndx58m5-chatgpt-unwrapped-26.1016.51333/lib/chatgpt/resources/native/remote-control-device-key.node
auto-formatelf: libtss2-mu.so.0 not found, wanted by /nix/store/vfa145smh7h5szg068jw03ghpndx58m5-chatgpt-unwrapped-26.1016.51333/lib/chatgpt/resources/native/remote-control-device-key.node
auto-formatelf: libtss2-tcti-device.so.0 not found, wanted by /nix/store/vfa145smh7h5szg068jw03ghpndx58m5-chatgpt-unwrapped-26.1016.51333/lib/chatgpt/resources/native/remote-control-device-key.node
auto-formatelf: ignoring missing libc.musl-x86_64.so.1 wanted by /nix/store/vfa145smh7h5szg068jw03ghpndx58m5-chatgpt-unwrapped-26.1016.51333/lib/chatgpt/resources/app.asar.unpacked/node_modules/@worklouder/device-kit-oai/node_modules/@worklouder/wl-device-kit/node_modules/node-hid/prebuilds/HID-linux-x64-musl/node-napi-v4.node
auto-formatelf: ignoring missing libc.musl-x86_64.so.1 wanted by /nix/store/vfa145smh7h5szg068jw03ghpndx58m5-chatgpt-unwrapped-26.1016.51333/lib/chatgpt/resources/app.asar.unpacked/node_modules/@worklouder/device-kit-oai/node_modules/@worklouder/wl-device-kit/node_modules/serialport/node_modules/@serialport/bindings-cpp/prebuilds/linux-x64/node.napi.musl.node
auto-formatelf: ignoring missing libc.musl-x86_64.so.1 wanted by /nix/store/vfa145smh7h5szg068jw03ghpndx58m5-chatgpt-unwrapped-26.1016.51333/lib/chatgpt/resources/app.asar.unpacked/node_modules/@worklouder/device-kit-oai/node_modules/@worklouder/wl-device-kit/node_modules/node-hid/prebuilds/HID_hidraw-linux-x64-musl/node-napi-v4.node
auto-formatelf: auto-formatelf could not satisfy all dependencies; add them to --libs or pass --ignore-missing
failed checks.x86_64-linux.pkgs-copilot-cli 11s
copilot-cli-1.0.101: unpacking source archive /nix/store/j70vvs8l7xcx6vlhjnrmnmi8w0qr0ghl-copilot-linux-x64-1.0.101.tgz source root is package setting SOURCE_DA …
copilot-cli-1.0.101:
unpacking source archive /nix/store/j70vvs8l7xcx6vlhjnrmnmi8w0qr0ghl-copilot-linux-x64-1.0.101.tgz
source root is package
setting SOURCE_DATE_EPOCH to timestamp 499162500 of file "package/package.json"
no configure script, doing nothing
checking for references to /build/ in /nix/store/w56h5bnx9jlwpxq9h7blxvn6gyw147r7-copilot-cli-1.0.101...
patching script interpreter paths in /nix/store/w56h5bnx9jlwpxq9h7blxvn6gyw147r7-copilot-cli-1.0.101
Executing versionCheckPhase
Did not find version 1.0.101 in the output of the command /nix/store/w56h5bnx9jlwpxq9h7blxvn6gyw147r7-copilot-cli-1.0.101/bin/copilot --version
failed checks.x86_64-linux.pkgs-fx 32m 34s
setup: these 2 derivations will be built: /nix/store/n5y6kw32wzm5j7ir2ynnfs6xdfgc3dgx-fx-0.0.14.drv /nix/store/n69a3xa5cq9n8fqc24yvpvln2z8y6l1q-check-fx.drv …
setup:
these 2 derivations will be built:
  /nix/store/n5y6kw32wzm5j7ir2ynnfs6xdfgc3dgx-fx-0.0.14.drv
  /nix/store/n69a3xa5cq9n8fqc24yvpvln2z8y6l1q-check-fx.drv
error: timed out after 1200 seconds
error: Cannot build '/nix/store/n69a3xa5cq9n8fqc24yvpvln2z8y6l1q-check-fx.drv'.
       Reason: 1 dependency failed.
       Output paths:
         /nix/store/r43mhyz34flr8sxnjzwzyz1pff77glq2-check-fx
failed checks.x86_64-linux.pkgs-hermes-agent 25m 20s
hermes-agent-0.22.2: Repacking wheel as ./hermes_agent-0.0.0-py3-none-any.whl...OK /build/source Finished executing pypaBuildPhase buildPhase completed in 35 se …
hermes-agent-0.22.2:
Repacking wheel as ./hermes_agent-0.0.0-py3-none-any.whl...OK
/build/source
Finished executing pypaBuildPhase
buildPhase completed in 35 seconds
Executing pythonRuntimeDepsCheck
Checking runtime dependencies for hermes_agent-0.0.0-py3-none-any.whl
  - prompt-toolkit==3.0.52 not satisfied by version 3.0.53
  - markdown==3.10.2 not satisfied by version 3.10.3
failed checks.x86_64-linux.pkgs-hermes-desktop 35m 36s
hermes-agent-0.22.2: Repacking wheel as ./hermes_agent-0.0.0-py3-none-any.whl...OK /build/source Finished executing pypaBuildPhase buildPhase completed in 38 se …
hermes-agent-0.22.2:
Repacking wheel as ./hermes_agent-0.0.0-py3-none-any.whl...OK
/build/source
Finished executing pypaBuildPhase
buildPhase completed in 38 seconds
Executing pythonRuntimeDepsCheck
Checking runtime dependencies for hermes_agent-0.0.0-py3-none-any.whl
  - prompt-toolkit==3.0.52 not satisfied by version 3.0.53
  - markdown==3.10.2 not satisfied by version 3.10.3
failed checks.x86_64-linux.pkgs-lean-ctx 32m 10s
setup: these 2 derivations will be built: /nix/store/24rraxkck3sip5n8ckyl5nrak0fvyikr-lean-ctx-3.11.4.drv /nix/store/945kxsl072hp3169xg1a21fvqqj3nb8z-check- …
setup:
these 2 derivations will be built:
  /nix/store/24rraxkck3sip5n8ckyl5nrak0fvyikr-lean-ctx-3.11.4.drv
  /nix/store/945kxsl072hp3169xg1a21fvqqj3nb8z-check-lean-ctx.drv
error: timed out after 1200 seconds
error: Cannot build '/nix/store/945kxsl072hp3169xg1a21fvqqj3nb8z-check-lean-ctx.drv'.
       Reason: 1 dependency failed.
       Output paths:
         /nix/store/chyhij4kkk0cv3lgfd7qbx1qyq7hl2s3-check-lean-ctx
failed checks.x86_64-linux.pkgs-mistral-vibe 37m 35s
setup: /nix/store/9xjf0cil1la0gcn2nb9v1jdyr25adq4v-mistral-vibe-3.0.1.drv /nix/store/h9mki78llcmibz8a2jh21rdz0dgwkjv9-check-mistral-vibe.drv error: timed ou …
setup:
  /nix/store/9xjf0cil1la0gcn2nb9v1jdyr25adq4v-mistral-vibe-3.0.1.drv
  /nix/store/h9mki78llcmibz8a2jh21rdz0dgwkjv9-check-mistral-vibe.drv
error: timed out after 1200 seconds
error: Cannot build '/nix/store/6b0jfir68snfmcliw7qcywh9q882gnpi-python3.14-humanize-4.16.0.drv'.
       Reason: 1 dependency failed.
       Output paths:
         /nix/store/j3swgz0rx33d24z30ka769jzf09cwfhw-python3.14-humanize-4.16.0
         /nix/store/lr5wl7in7ain60pgjhd89h3p4afsv63i-python3.14-humanize-4.16.0-dist
error: Cannot build '/nix/store/j051kp2gn6nnb1aic0hc9zlwav97l29d-python3.14-jsonpath-python-1.1.6.drv'.
       Reason: 1 dependency failed.
       Output paths:
         /nix/store/lvz8sv2pjyc9cs5wc80afh6hm43bigbv-python3.14-jsonpath-python-1.1.6-dist
         /nix/store/mi6lz9a764csf9vsy8z4ja0f91lanihn-python3.14-jsonpath-python-1.1.6
error: Cannot build '/nix/store/9q1czr7av2xpd8dlhd2pillxxc6rj7z9-python3.14-mistralai-2.6.0.drv'.
       Reason: 1 dependency failed.
       Output paths:
         /nix/store/az5g1kph55fz9a262ksdm008bbcx3vyv-python3.14-mistralai-2.6.0
         /nix/store/kw18klj7gja2zkqkj8cqdlncihhc2606-python3.14-mistralai-2.6.0-dist
error: Cannot build '/nix/store/9xjf0cil1la0gcn2nb9v1jdyr25adq4v-mistral-vibe-3.0.1.drv'.
       Reason: 2 dependencies failed.
       Output paths:
         /nix/store/a7lfqhj5ynl5dspkyxivp4pcpbkhr7ik-mistral-vibe-3.0.1
         /nix/store/hw8h70dmbg9mrvgfvahnlkd4zmcs0n2d-mistral-vibe-3.0.1-dist
error: Cannot build '/nix/store/h9mki78llcmibz8a2jh21rdz0dgwkjv9-check-mistral-vibe.drv'.
       Reason: 1 dependency failed.
       Output paths:
         /nix/store/vca9q8dx32h0p1xr2mr6qavsy4h26ggi-check-mistral-vibe
failed checks.x86_64-linux.pkgs-officecli 20m 44s
setup: these 2 derivations will be built: /nix/store/i96l0ibh7l6rm06g1kkd7qsc9hj6cs0g-officecli-1.0.158.drv /nix/store/m5bygg2bb62gp1pvdrxhkzq6kl6qg74p-chec …
setup:
these 2 derivations will be built:
  /nix/store/i96l0ibh7l6rm06g1kkd7qsc9hj6cs0g-officecli-1.0.158.drv
  /nix/store/m5bygg2bb62gp1pvdrxhkzq6kl6qg74p-check-officecli.drv
error: timed out after 1200 seconds
error: Cannot build '/nix/store/m5bygg2bb62gp1pvdrxhkzq6kl6qg74p-check-officecli.drv'.
       Reason: 1 dependency failed.
       Output paths:
         /nix/store/9ygdl4sk4slq7kq395sw7zjr8np3gsi6-check-officecli
failed checks.x86_64-linux.pkgs-orbi-cli 21s
orbi-cli-0.7.12: 264 _callImplicitHook /nix/store/an9g93vg5b02j74y38zfajswa0f10p2z-stdenv-linux/setup 281 _eval /nix/store/an9g93vg5b02j74y38zfajswa0f10p2z-stde …
orbi-cli-0.7.12:
264 _callImplicitHook /nix/store/an9g93vg5b02j74y38zfajswa0f10p2z-stdenv-linux/setup
281 _eval /nix/store/an9g93vg5b02j74y38zfajswa0f10p2z-stdenv-linux/setup
220 runHook /nix/store/an9g93vg5b02j74y38zfajswa0f10p2z-stdenv-linux/setup
1666 fixupPhase /nix/store/an9g93vg5b02j74y38zfajswa0f10p2z-stdenv-linux/setup
1771 runPhase /nix/store/an9g93vg5b02j74y38zfajswa0f10p2z-stdenv-linux/setup
1826 genericBuild /nix/store/an9g93vg5b02j74y38zfajswa0f10p2z-stdenv-linux/setup
1 source /nix/store/shkw4qm9qcw5sc5n1k5jznc83ny02r39-default-builder.sh
3 main /nix/store/l622p70vy8k5sh7y5wizi5f2mic6ynpg-source-stdenv.sh
118 succeeded
succeeded attributes
status attribute duration
loading…
550 already built
skipped attributes
status attribute duration
loading…