numtide/llm-agents.nix build #8395 failed ← #8394 #8396 →
eval warnings
2 kinds
· 2 occurrences
- warn setting 'accept-flake-config' is ignored: iets never applies a flake's nixConfig, so a flake that sets extra-substituters or allow-import-from-derivation there runs without them; put the settings in nix.conf ×1
- warn setting 'plugin-files' is ignored: iets loads no plugins ×1
3 failed
| status | attribute | duration |
|---|---|---|
checks.aarch64-darwin.pkgs-mcptoon
|
2m 37s | |
mcptoon-0.8.25: self._warn_or_fail_if_strict(f"Unknown config option: {key}\n") ../../../../../store/cp1hsk9pigafw8kz9xpa6s697019hlq1-python3.14-pytest-9.1. …mcptoon-0.8.25:
self._warn_or_fail_if_strict(f"Unknown config option: {key}\n")
../../../../../store/cp1hsk9pigafw8kz9xpa6s697019hlq1-python3.14-pytest-9.1.1/lib/python3.14/site-packages/_pytest/config/__init__.py:1464
/nix/store/cp1hsk9pigafw8kz9xpa6s697019hlq1-python3.14-pytest-9.1.1/lib/python3.14/site-packages/_pytest/config/__init__.py:1464: PytestConfigWarning: Unknown config option: timeout_method
self._warn_or_fail_if_strict(f"Unknown config option: {key}\n")
-- Docs: https://docs.pytest.org/en/stable/how-to/capture-warnings.html
=========================== short test summary info ============================
FAILED tests/test_mode_delivery_surfaces.py::test_changelog_has_unreleased_delivery_mode - AssertionError: assert '## [Unreleased]' in '# Changelog\n\nAll notable cha...
= 1 failed, 2651 passed, 14 skipped, 7 deselected, 2 warnings in 131.44s (0:02:11) =
|
||
checks.aarch64-linux.pkgs-mcptoon
|
2m 45s | |
mcptoon-0.8.25: self._warn_or_fail_if_strict(f"Unknown config option: {key}\n") ../../nix/store/0zm37a70sfgc2zwgbwv9kv75hlv5d4lc-python3.14-pytest-9.1.1/lib …mcptoon-0.8.25:
self._warn_or_fail_if_strict(f"Unknown config option: {key}\n")
../../nix/store/0zm37a70sfgc2zwgbwv9kv75hlv5d4lc-python3.14-pytest-9.1.1/lib/python3.14/site-packages/_pytest/config/__init__.py:1464
/nix/store/0zm37a70sfgc2zwgbwv9kv75hlv5d4lc-python3.14-pytest-9.1.1/lib/python3.14/site-packages/_pytest/config/__init__.py:1464: PytestConfigWarning: Unknown config option: timeout_method
self._warn_or_fail_if_strict(f"Unknown config option: {key}\n")
-- Docs: https://docs.pytest.org/en/stable/how-to/capture-warnings.html
=========================== short test summary info ============================
FAILED tests/test_mode_delivery_surfaces.py::test_changelog_has_unreleased_delivery_mode - AssertionError: assert '## [Unreleased]' in '# Changelog\n\nAll notable cha...
= 1 failed, 2652 passed, 13 skipped, 7 deselected, 2 warnings in 129.40s (0:02:09) =
|
||
checks.x86_64-linux.pkgs-mcptoon
|
5m 53s | |
mcptoon-0.8.25: self._warn_or_fail_if_strict(f"Unknown config option: {key}\n") ../../nix/store/v0axk356l7kzmgfdwprgrys2a02l9amk-python3.14-pytest-9.1.1/lib …mcptoon-0.8.25:
self._warn_or_fail_if_strict(f"Unknown config option: {key}\n")
../../nix/store/v0axk356l7kzmgfdwprgrys2a02l9amk-python3.14-pytest-9.1.1/lib/python3.14/site-packages/_pytest/config/__init__.py:1464
/nix/store/v0axk356l7kzmgfdwprgrys2a02l9amk-python3.14-pytest-9.1.1/lib/python3.14/site-packages/_pytest/config/__init__.py:1464: PytestConfigWarning: Unknown config option: timeout_method
self._warn_or_fail_if_strict(f"Unknown config option: {key}\n")
-- Docs: https://docs.pytest.org/en/stable/how-to/capture-warnings.html
=========================== short test summary info ============================
FAILED tests/test_mode_delivery_surfaces.py::test_changelog_has_unreleased_delivery_mode - AssertionError: assert '## [Unreleased]' in '# Changelog\n\nAll notable cha...
= 1 failed, 2652 passed, 13 skipped, 7 deselected, 2 warnings in 286.80s (0:04:46) =
|
||
13 succeeded
| status | attribute | duration |
|---|---|---|
| loading… | ||
681 already built
| status | attribute | duration |
|---|---|---|
| loading… | ||