nixbot

builds

numtide/llm-agents.nix build #8280 failed

branch main · PR #11085 · commit 8d88e602d3 · · took 1h 29m · eval 5m 4s

eval warnings 2 kinds · 2 occurrences
  • warn setting 'accept-flake-config' is ignored: iets never applies a flake's nixConfig, so a flake that sets extra-substituters or allow-import-from-derivation there runs without them; put the settings in nix.conf ×1
  • warn setting 'plugin-files' is ignored: iets loads no plugins ×1

30 failed
failed attributes
status attribute duration
failed checks.aarch64-darwin.pkgs-agent-browser 5m 18s
check-agent-browser: mac02: building 6mxjmlr2jl18f8g5w40pa3zawc06a4ay-check-agent-browser.drv
check-agent-browser:
mac02: building 6mxjmlr2jl18f8g5w40pa3zawc06a4ay-check-agent-browser.drv
failed checks.aarch64-darwin.pkgs-apm 10s
apm-0.34.0: adding 'apm_cli-0.34.0.dist-info/RECORD' removing build/bdist.macosx-14.0-arm64/wheel Successfully built apm_cli-0.34.0-py3-none-any.whl Finished cr …
apm-0.34.0:
adding 'apm_cli-0.34.0.dist-info/RECORD'
removing build/bdist.macosx-14.0-arm64/wheel
Successfully built apm_cli-0.34.0-py3-none-any.whl
Finished creating a wheel...
Finished executing pypaBuildPhase
Executing pythonRuntimeDepsCheck
Checking runtime dependencies for apm_cli-0.34.0-py3-none-any.whl
  - websockets<17,>=12 not satisfied by version 17.0.1
failed checks.aarch64-darwin.pkgs-autolith 3m 6s
setup: /nix/store/51d578dq773x0kqfhm1jqqa6qz24fcbc-sbcl-usocket-0.8.9 /nix/store/hlrhy324h0bsv2zar89w9riywdaxxsza-sbcl-xsubseq-20170830-git /nix/store/ps1 …
setup:
  /nix/store/51d578dq773x0kqfhm1jqqa6qz24fcbc-sbcl-usocket-0.8.9
  /nix/store/hlrhy324h0bsv2zar89w9riywdaxxsza-sbcl-xsubseq-20170830-git
  /nix/store/ps1219jp4z9i4pcsmbbvx74kmd2cq39l-sbcl-yason-20250622-git
  /nix/store/2j2hj8xwdg230fp4xb5753h4cpa1p0gr-sbcl-zpb-exif-release-1.2.5
  /nix/store/lvvp7k212r5xqjd6y9bamx8bydxhg96q-sbcl-zpng-1.2.2
  /nix/store/r4rsq99h3252r1vmbm3wz4wcxsw8gb24-shell_cmds-329
could not copy /nix/store/xq6mj8llfy7a7p1wq6skq5ir4gp8nhd7-sbcl-idsmall-0.1.0: error: gRPC FetchNars failed: failed to connect to all addresses; last error: UNKNOWN: ipv6:%5B2a01:4f9:3071:1fc8::1%5D:50051: handshaker shutdown
error: some outputs are unexpectedly invalid
failed checks.aarch64-darwin.pkgs-hermes-agent 1m 22s
hermes-agent-0.22.2: Repacking wheel as ./hermes_agent-0.0.0-py3-none-any.whl...OK /nix/var/nix/builds/nix-57509-1767176358/source Finished executing pypaBuildP …
hermes-agent-0.22.2:
Repacking wheel as ./hermes_agent-0.0.0-py3-none-any.whl...OK
/nix/var/nix/builds/nix-57509-1767176358/source
Finished executing pypaBuildPhase
buildPhase completed in 53 seconds
Executing pythonRuntimeDepsCheck
Checking runtime dependencies for hermes_agent-0.0.0-py3-none-any.whl
  - prompt-toolkit==3.0.52 not satisfied by version 3.0.53
  - markdown==3.10.2 not satisfied by version 3.10.3
failed checks.aarch64-darwin.pkgs-hermes-desktop 22s
hermes-agent-0.22.2: Unpacking to: unpacked/hermes_agent-0.0.0...OK Repacking wheel as ./hermes_agent-0.0.0-py3-none-any.whl...OK /nix/var/nix/builds/nix-23230- …
hermes-agent-0.22.2:
Unpacking to: unpacked/hermes_agent-0.0.0...OK
Repacking wheel as ./hermes_agent-0.0.0-py3-none-any.whl...OK
/nix/var/nix/builds/nix-23230-902979706/source
Finished executing pypaBuildPhase
Executing pythonRuntimeDepsCheck
Checking runtime dependencies for hermes_agent-0.0.0-py3-none-any.whl
  - prompt-toolkit==3.0.52 not satisfied by version 3.0.53
  - markdown==3.10.2 not satisfied by version 3.10.3
failed checks.aarch64-darwin.pkgs-orbi-cli 10s
orbi-cli-0.7.10: 272 _callImplicitHook /nix/store/4gqzn5ia76rp74p8fb6nvry3arbn3l7j-stdenv-darwin/setup 289 _eval /nix/store/4gqzn5ia76rp74p8fb6nvry3arbn3l7j-std …
orbi-cli-0.7.10:
272 _callImplicitHook /nix/store/4gqzn5ia76rp74p8fb6nvry3arbn3l7j-stdenv-darwin/setup
289 _eval /nix/store/4gqzn5ia76rp74p8fb6nvry3arbn3l7j-stdenv-darwin/setup
228 runHook /nix/store/4gqzn5ia76rp74p8fb6nvry3arbn3l7j-stdenv-darwin/setup
1674 fixupPhase /nix/store/4gqzn5ia76rp74p8fb6nvry3arbn3l7j-stdenv-darwin/setup
1779 runPhase /nix/store/4gqzn5ia76rp74p8fb6nvry3arbn3l7j-stdenv-darwin/setup
1834 genericBuild /nix/store/4gqzn5ia76rp74p8fb6nvry3arbn3l7j-stdenv-darwin/setup
1 source /nix/store/shkw4qm9qcw5sc5n1k5jznc83ny02r39-default-builder.sh
3 main /nix/store/l622p70vy8k5sh7y5wizi5f2mic6ynpg-source-stdenv.sh
failed checks.aarch64-darwin.pkgs-ralph-tui 8m 1s
setup: warning: SQLite database '/nix/var/nix/db/db.sqlite' is busy warning: SQLite database '/nix/var/nix/db/db.sqlite' is busy warning: SQLite database '/nix/ …
setup:
warning: SQLite database '/nix/var/nix/db/db.sqlite' is busy
warning: SQLite database '/nix/var/nix/db/db.sqlite' is busy
warning: SQLite database '/nix/var/nix/db/db.sqlite' is busy
warning: SQLite database '/nix/var/nix/db/db.sqlite' is busy
warning: SQLite database '/nix/var/nix/db/db.sqlite' is busy
could not copy /nix/store/qvapawjrn5w6nn23pga365iib9qb118f-bun-pkg-peek-readable-4.1.0: error: gRPC FetchNars failed: failed to connect to all addresses; last error: UNKNOWN: ipv4:65.21.215.17:50051: tcp handshaker shutdown
could not copy /nix/store/w922r5171km66i7yfcz77j1nvg4g8272-bun-pkg-readable-stream-4.7.0: error: gRPC FetchNars failed: failed to connect to all addresses; last error: UNKNOWN: ipv4:65.21.215.17:50051: tcp handshaker shutdown
error: some outputs are unexpectedly invalid
failed checks.aarch64-linux.pkgs-apm 2m 40s
apm-0.34.0: adding 'apm_cli-0.34.0.dist-info/RECORD' removing build/bdist.linux-aarch64/wheel Successfully built apm_cli-0.34.0-py3-none-any.whl Finished creati …
apm-0.34.0:
adding 'apm_cli-0.34.0.dist-info/RECORD'
removing build/bdist.linux-aarch64/wheel
Successfully built apm_cli-0.34.0-py3-none-any.whl
Finished creating a wheel...
Finished executing pypaBuildPhase
Executing pythonRuntimeDepsCheck
Checking runtime dependencies for apm_cli-0.34.0-py3-none-any.whl
  - websockets<17,>=12 not satisfied by version 17.0.1
failed checks.aarch64-linux.pkgs-chatgpt 51s
chatgpt-unwrapped-26.1013.40934: /nix/store/y3pfcdkpayyfdgxgd7a2lf4jkf2rzpv3-chatgpt-unwrapped-26.1013.40934/lib/chatgpt/resources/cua_node/bin/corepack: interp …
chatgpt-unwrapped-26.1013.40934:
/nix/store/y3pfcdkpayyfdgxgd7a2lf4jkf2rzpv3-chatgpt-unwrapped-26.1013.40934/lib/chatgpt/resources/cua_node/bin/corepack: interpreter directive changed from "#!/usr/bin/env sh" to "/nix/store/czx7cscpnqqmc9nwmbpnv2zcvck64mmf-bash-5.3p20/bin/sh"
/nix/store/y3pfcdkpayyfdgxgd7a2lf4jkf2rzpv3-chatgpt-unwrapped-26.1013.40934/lib/chatgpt/resources/cua_node/bin/setup.sh: interpreter directive changed from "#!/usr/bin/env bash" to "/nix/store/czx7cscpnqqmc9nwmbpnv2zcvck64mmf-bash-5.3p20/bin/bash"
auto-formatelf: libtss2-esys.so.0 not found, wanted by /nix/store/y3pfcdkpayyfdgxgd7a2lf4jkf2rzpv3-chatgpt-unwrapped-26.1013.40934/lib/chatgpt/resources/native/remote-control-device-key.node
auto-formatelf: libtss2-mu.so.0 not found, wanted by /nix/store/y3pfcdkpayyfdgxgd7a2lf4jkf2rzpv3-chatgpt-unwrapped-26.1013.40934/lib/chatgpt/resources/native/remote-control-device-key.node
auto-formatelf: libtss2-tcti-device.so.0 not found, wanted by /nix/store/y3pfcdkpayyfdgxgd7a2lf4jkf2rzpv3-chatgpt-unwrapped-26.1013.40934/lib/chatgpt/resources/native/remote-control-device-key.node
auto-formatelf: ignoring missing liblog.so wanted by /nix/store/y3pfcdkpayyfdgxgd7a2lf4jkf2rzpv3-chatgpt-unwrapped-26.1013.40934/lib/chatgpt/resources/app.asar.unpacked/node_modules/@worklouder/device-kit-oai/node_modules/@worklouder/wl-device-kit/node_modules/serialport/node_modules/@serialport/bindings-cpp/prebuilds/android-arm64/node.napi.armv8.node
auto-formatelf: ignoring missing libc++_shared.so wanted by /nix/store/y3pfcdkpayyfdgxgd7a2lf4jkf2rzpv3-chatgpt-unwrapped-26.1013.40934/lib/chatgpt/resources/app.asar.unpacked/node_modules/@worklouder/device-kit-oai/node_modules/@worklouder/wl-device-kit/node_modules/serialport/node_modules/@serialport/bindings-cpp/prebuilds/android-arm64/node.napi.armv8.node
auto-formatelf: auto-formatelf could not satisfy all dependencies; add them to --libs or pass --ignore-missing
failed checks.aarch64-linux.pkgs-copilot-cli 12s
copilot-cli-1.0.100: unpacking source archive /nix/store/bmq2yirqblnbgdap8dgxn3wldw61jyjm-copilot-linux-arm64-1.0.100.tgz source root is package setting SOURCE_ …
copilot-cli-1.0.100:
unpacking source archive /nix/store/bmq2yirqblnbgdap8dgxn3wldw61jyjm-copilot-linux-arm64-1.0.100.tgz
source root is package
setting SOURCE_DATE_EPOCH to timestamp 499162500 of file "package/package.json"
no configure script, doing nothing
checking for references to /build/ in /nix/store/ik7rxdh4dkfw898p19kr3awdling00yk-copilot-cli-1.0.100...
patching script interpreter paths in /nix/store/ik7rxdh4dkfw898p19kr3awdling00yk-copilot-cli-1.0.100
Executing versionCheckPhase
Did not find version 1.0.100 in the output of the command /nix/store/ik7rxdh4dkfw898p19kr3awdling00yk-copilot-cli-1.0.100/bin/copilot --version
failed checks.aarch64-linux.pkgs-hermes-agent 2m 44s
hermes-agent-0.22.2: Unpacking to: unpacked/hermes_agent-0.0.0...OK Repacking wheel as ./hermes_agent-0.0.0-py3-none-any.whl...OK /build/source Finished executi …
hermes-agent-0.22.2:
Unpacking to: unpacked/hermes_agent-0.0.0...OK
Repacking wheel as ./hermes_agent-0.0.0-py3-none-any.whl...OK
/build/source
Finished executing pypaBuildPhase
Executing pythonRuntimeDepsCheck
Checking runtime dependencies for hermes_agent-0.0.0-py3-none-any.whl
  - prompt-toolkit==3.0.52 not satisfied by version 3.0.53
  - markdown==3.10.2 not satisfied by version 3.10.3
failed checks.aarch64-linux.pkgs-hermes-desktop 30s
hermes-agent-0.22.2: Unpacking to: unpacked/hermes_agent-0.0.0...OK Repacking wheel as ./hermes_agent-0.0.0-py3-none-any.whl...OK /build/source Finished executi …
hermes-agent-0.22.2:
Unpacking to: unpacked/hermes_agent-0.0.0...OK
Repacking wheel as ./hermes_agent-0.0.0-py3-none-any.whl...OK
/build/source
Finished executing pypaBuildPhase
Executing pythonRuntimeDepsCheck
Checking runtime dependencies for hermes_agent-0.0.0-py3-none-any.whl
  - prompt-toolkit==3.0.52 not satisfied by version 3.0.53
  - markdown==3.10.2 not satisfied by version 3.10.3
failed checks.aarch64-linux.pkgs-mirasim 34s
setup: these 2 derivations will be built: /nix/store/63rk9bv2hvnc3yg265xxznjgdxmn96i9-mirasim-0.0.565.drv /nix/store/ag4vkgh6xlxcvyvrv93mp1b9903qrpsb-check- …
setup:
these 2 derivations will be built:
  /nix/store/63rk9bv2hvnc3yg265xxznjgdxmn96i9-mirasim-0.0.565.drv
  /nix/store/ag4vkgh6xlxcvyvrv93mp1b9903qrpsb-check-mirasim.drv
could not copy /nix/store/wb8al3qd966c0ld0qij3npc2xrlya5wc-mirasim-0.0.565: error: gRPC FetchNars failed: failed to connect to all addresses; last error: UNKNOWN: ipv4:65.21.215.17:50051: connection attempt timed out before receiving SETTINGS frame
error: some outputs are unexpectedly invalid
failed checks.aarch64-linux.pkgs-omp 2m 41s
setup: /nix/store/qnml9ys77z2xh2hmvjwvxj1nip4ywwrq-bun-pkg-sherpa-onnx-1.13.2.drv /nix/store/zpfqnlbk9y0g8mrp95yxasx6x3pkl64m-bun-pkg-yargs-16.2.2.drv /ni …
setup:
  /nix/store/qnml9ys77z2xh2hmvjwvxj1nip4ywwrq-bun-pkg-sherpa-onnx-1.13.2.drv
  /nix/store/zpfqnlbk9y0g8mrp95yxasx6x3pkl64m-bun-pkg-yargs-16.2.2.drv
  /nix/store/3kpkr9gk9bcghckqwi939p2km1aajmf3-bun-cache.drv
  /nix/store/lvmy1vrm172r60fi8xj17dryv583a88k-omp-18.12.3-cargo-vendor-vendor.drv
  /nix/store/b7k9jv8jr7xqgjy14vm6i1xb74l3s3wx-omp-18.12.3.drv
  /nix/store/7l8crwwlznrzkb1qyl9jfc4vdpxb3pjp-check-omp.drv
could not copy /nix/store/nwvdfhm12i7lcadixig0wi0i45cnb0vk-omp-18.12.3-cargo-vendor-vendor: error: gRPC FetchNars failed: Stream removed (sendmsg: Broken pipe (32))
error: some outputs are unexpectedly invalid
failed checks.aarch64-linux.pkgs-orbi-cli 3m 47s
orbi-cli-0.7.10: 264 _callImplicitHook /nix/store/49cnv1lz3hiybz55z8lm8i401iqrpqyw-stdenv-linux/setup 281 _eval /nix/store/49cnv1lz3hiybz55z8lm8i401iqrpqyw-stde …
orbi-cli-0.7.10:
264 _callImplicitHook /nix/store/49cnv1lz3hiybz55z8lm8i401iqrpqyw-stdenv-linux/setup
281 _eval /nix/store/49cnv1lz3hiybz55z8lm8i401iqrpqyw-stdenv-linux/setup
220 runHook /nix/store/49cnv1lz3hiybz55z8lm8i401iqrpqyw-stdenv-linux/setup
1666 fixupPhase /nix/store/49cnv1lz3hiybz55z8lm8i401iqrpqyw-stdenv-linux/setup
1771 runPhase /nix/store/49cnv1lz3hiybz55z8lm8i401iqrpqyw-stdenv-linux/setup
1826 genericBuild /nix/store/49cnv1lz3hiybz55z8lm8i401iqrpqyw-stdenv-linux/setup
1 source /nix/store/shkw4qm9qcw5sc5n1k5jznc83ny02r39-default-builder.sh
3 main /nix/store/l622p70vy8k5sh7y5wizi5f2mic6ynpg-source-stdenv.sh
failed checks.aarch64-linux.pkgs-orca 4m 43s
… and 1 more failed derivation
… and 1 more failed derivation
failed checks.aarch64-linux.pkgs-zcode 4m 43s
… and 1 more failed derivation
… and 1 more failed derivation
failed checks.x86_64-linux.pkgs-agent-browser 29m 35s
setup: /nix/store/1sda328rshrqarp3jsz1rd1h3bjj3fy7-chromium-155.0.8059.84 /nix/store/waalw2dr3fznpracyp57mka7xwx0a5xj-chromium-155.0.8059.84-sandbox /nix/ …
setup:
  /nix/store/1sda328rshrqarp3jsz1rd1h3bjj3fy7-chromium-155.0.8059.84
  /nix/store/waalw2dr3fznpracyp57mka7xwx0a5xj-chromium-155.0.8059.84-sandbox
  /nix/store/ckqbl0wk2cq2gwk9rqamj4rkxjczgr8h-chromium-unwrapped-155.0.8059.84
  /nix/store/mrzq6ij82bpjxl7wgmj1rs253nj23hm6-chromium-unwrapped-155.0.8059.84-sandbox
  /nix/store/8fx1lw5q5j5d3z75c17lv6fhc5m0dkwq-nodejs-slim-22.23.3-dev
  /nix/store/69672dnmpdanjs6fj2g8l8wn2hswrhyv-pnpm-11.27.0
error: timed out after 1200 seconds
error: Cannot build '/nix/store/ddmskmrbhjj88gmlhkj4xhninz6shq04-check-agent-browser.drv'.
       Reason: 1 dependency failed.
       Output paths:
         /nix/store/gyikqik70gbnl54wcxblxz2vds1qmna1-check-agent-browser
failed checks.x86_64-linux.pkgs-agent-deck 20m 55s
agent-deck-1.16.27: github.com/asheshgoplani/agent-deck/cmd/agent-deck.TestCleanupExcludesLiveProcessCWDInside(0x1905e7cdc488) /build/source/cmd/agent-deck/wor …
agent-deck-1.16.27:
github.com/asheshgoplani/agent-deck/cmd/agent-deck.TestCleanupExcludesLiveProcessCWDInside(0x1905e7cdc488)
	/build/source/cmd/agent-deck/worktree_cleanup_safety_test.go:121 +0x2a
testing.tRunner(0x1905e7cdc488, 0x22e5d98)
	/nix/store/bbqjsl8fzayd8c2i63skp7hybysvwr03-go-1.26.9/share/go/src/testing/testing.go:2036 +0xea
created by testing.(*T).Run in goroutine 1
	/nix/store/bbqjsl8fzayd8c2i63skp7hybysvwr03-go-1.26.9/share/go/src/testing/testing.go:2101 +0x4c5
FAIL	github.com/asheshgoplani/agent-deck/cmd/agent-deck	641.843s
FAIL
failed checks.x86_64-linux.pkgs-apm 30s
apm-0.34.0: adding 'apm_cli-0.34.0.dist-info/RECORD' removing build/bdist.linux-x86_64/wheel Successfully built apm_cli-0.34.0-py3-none-any.whl Finished creatin …
apm-0.34.0:
adding 'apm_cli-0.34.0.dist-info/RECORD'
removing build/bdist.linux-x86_64/wheel
Successfully built apm_cli-0.34.0-py3-none-any.whl
Finished creating a wheel...
Finished executing pypaBuildPhase
Executing pythonRuntimeDepsCheck
Checking runtime dependencies for apm_cli-0.34.0-py3-none-any.whl
  - websockets<17,>=12 not satisfied by version 17.0.1
failed checks.x86_64-linux.pkgs-aven 33m 53s
setup: these 3 derivations will be built: /nix/store/441xx0zac4p3skxwhrqxj6ypsxa3ljya-aven-0.1.50-vendor.drv /nix/store/7kl6kd77s1qydvw47y6m98jdf8gjlmkj-ave …
setup:
these 3 derivations will be built:
  /nix/store/441xx0zac4p3skxwhrqxj6ypsxa3ljya-aven-0.1.50-vendor.drv
  /nix/store/7kl6kd77s1qydvw47y6m98jdf8gjlmkj-aven-0.1.50.drv
  /nix/store/ca4lskiky8c71i4b4r0720wnhyzx1c9h-check-aven.drv
error: timed out after 1200 seconds
error: Cannot build '/nix/store/ca4lskiky8c71i4b4r0720wnhyzx1c9h-check-aven.drv'.
       Reason: 1 dependency failed.
       Output paths:
         /nix/store/qjc7igdbd6v2xf41w3kybm0vp8madzyy-check-aven
failed checks.x86_64-linux.pkgs-chatgpt 2m 2s
chatgpt-unwrapped-26.1013.40934: /nix/store/9vc4qrmhdkx15lcs4jgm7g8ppkdnki57-chatgpt-unwrapped-26.1013.40934/lib/chatgpt/resources/cua_node/bin/setup.sh: interp …
chatgpt-unwrapped-26.1013.40934:
/nix/store/9vc4qrmhdkx15lcs4jgm7g8ppkdnki57-chatgpt-unwrapped-26.1013.40934/lib/chatgpt/resources/cua_node/bin/setup.sh: interpreter directive changed from "#!/usr/bin/env bash" to "/nix/store/nnm9gdr70ihc6zc9298mzz8jpcgaciql-bash-5.3p20/bin/bash"
auto-formatelf: ignoring missing libc.musl-x86_64.so.1 wanted by /nix/store/9vc4qrmhdkx15lcs4jgm7g8ppkdnki57-chatgpt-unwrapped-26.1013.40934/lib/chatgpt/resources/app.asar.unpacked/node_modules/@worklouder/device-kit-oai/node_modules/@worklouder/wl-device-kit/node_modules/serialport/node_modules/@serialport/bindings-cpp/prebuilds/linux-x64/node.napi.musl.node
auto-formatelf: libtss2-esys.so.0 not found, wanted by /nix/store/9vc4qrmhdkx15lcs4jgm7g8ppkdnki57-chatgpt-unwrapped-26.1013.40934/lib/chatgpt/resources/native/remote-control-device-key.node
auto-formatelf: libtss2-mu.so.0 not found, wanted by /nix/store/9vc4qrmhdkx15lcs4jgm7g8ppkdnki57-chatgpt-unwrapped-26.1013.40934/lib/chatgpt/resources/native/remote-control-device-key.node
auto-formatelf: libtss2-tcti-device.so.0 not found, wanted by /nix/store/9vc4qrmhdkx15lcs4jgm7g8ppkdnki57-chatgpt-unwrapped-26.1013.40934/lib/chatgpt/resources/native/remote-control-device-key.node
auto-formatelf: ignoring missing libc.musl-x86_64.so.1 wanted by /nix/store/9vc4qrmhdkx15lcs4jgm7g8ppkdnki57-chatgpt-unwrapped-26.1013.40934/lib/chatgpt/resources/app.asar.unpacked/node_modules/@worklouder/device-kit-oai/node_modules/@worklouder/wl-device-kit/node_modules/node-hid/prebuilds/HID-linux-x64-musl/node-napi-v4.node
auto-formatelf: ignoring missing libc.musl-x86_64.so.1 wanted by /nix/store/9vc4qrmhdkx15lcs4jgm7g8ppkdnki57-chatgpt-unwrapped-26.1013.40934/lib/chatgpt/resources/app.asar.unpacked/node_modules/@worklouder/device-kit-oai/node_modules/@worklouder/wl-device-kit/node_modules/node-hid/prebuilds/HID_hidraw-linux-x64-musl/node-napi-v4.node
auto-formatelf: auto-formatelf could not satisfy all dependencies; add them to --libs or pass --ignore-missing
failed checks.x86_64-linux.pkgs-copilot-cli 11s
copilot-cli-1.0.100: unpacking source archive /nix/store/cywv3q86qwljf673nbjdriabaasxxgw0-copilot-linux-x64-1.0.100.tgz source root is package setting SOURCE_DA …
copilot-cli-1.0.100:
unpacking source archive /nix/store/cywv3q86qwljf673nbjdriabaasxxgw0-copilot-linux-x64-1.0.100.tgz
source root is package
setting SOURCE_DATE_EPOCH to timestamp 499162500 of file "package/package.json"
no configure script, doing nothing
checking for references to /build/ in /nix/store/i0j9gkn7m5ki16drj9nkhrs5j58yhxcf-copilot-cli-1.0.100...
patching script interpreter paths in /nix/store/i0j9gkn7m5ki16drj9nkhrs5j58yhxcf-copilot-cli-1.0.100
Executing versionCheckPhase
Did not find version 1.0.100 in the output of the command /nix/store/i0j9gkn7m5ki16drj9nkhrs5j58yhxcf-copilot-cli-1.0.100/bin/copilot --version
failed checks.x86_64-linux.pkgs-fx 27m 55s
setup: /nix/store/n5y6kw32wzm5j7ir2ynnfs6xdfgc3dgx-fx-0.0.14.drv /nix/store/n69a3xa5cq9n8fqc24yvpvln2z8y6l1q-check-fx.drv these 2 paths will be fetched (229 …
setup:
  /nix/store/n5y6kw32wzm5j7ir2ynnfs6xdfgc3dgx-fx-0.0.14.drv
  /nix/store/n69a3xa5cq9n8fqc24yvpvln2z8y6l1q-check-fx.drv
these 2 paths will be fetched (229.2 MiB download, 1.2 GiB unpacked):
  /nix/store/5ajx1np9zlq7z6ljqq18sibpzhnjakdw-clang-22.1.8-lib
  /nix/store/34wy21hkax0k707757pbgd77fjxdv6v5-zig-0.17.0
warning: SQLite database '/nix/var/nix/db/db.sqlite' is busy
error: timed out after 1200 seconds
error: Cannot build '/nix/store/n69a3xa5cq9n8fqc24yvpvln2z8y6l1q-check-fx.drv'.
       Reason: 1 dependency failed.
       Output paths:
         /nix/store/r43mhyz34flr8sxnjzwzyz1pff77glq2-check-fx
failed checks.x86_64-linux.pkgs-hermes-agent 33m 9s
hermes-agent-0.22.2: Repacking wheel as ./hermes_agent-0.0.0-py3-none-any.whl...OK /build/source Finished executing pypaBuildPhase buildPhase completed in 48 se …
hermes-agent-0.22.2:
Repacking wheel as ./hermes_agent-0.0.0-py3-none-any.whl...OK
/build/source
Finished executing pypaBuildPhase
buildPhase completed in 48 seconds
Executing pythonRuntimeDepsCheck
Checking runtime dependencies for hermes_agent-0.0.0-py3-none-any.whl
  - prompt-toolkit==3.0.52 not satisfied by version 3.0.53
  - markdown==3.10.2 not satisfied by version 3.10.3
failed checks.x86_64-linux.pkgs-hermes-desktop 4m 16s
hermes-agent-0.22.2: Repacking wheel as ./hermes_agent-0.0.0-py3-none-any.whl...OK /build/source Finished executing pypaBuildPhase buildPhase completed in 46 se …
hermes-agent-0.22.2:
Repacking wheel as ./hermes_agent-0.0.0-py3-none-any.whl...OK
/build/source
Finished executing pypaBuildPhase
buildPhase completed in 46 seconds
Executing pythonRuntimeDepsCheck
Checking runtime dependencies for hermes_agent-0.0.0-py3-none-any.whl
  - prompt-toolkit==3.0.52 not satisfied by version 3.0.53
  - markdown==3.10.2 not satisfied by version 3.10.3
failed checks.x86_64-linux.pkgs-lean-ctx 34m 29s
setup: these 3 derivations will be built: /nix/store/4zl7vd195knydmjxwfjbcqkx3wkfjj3w-lean-ctx-3.11.4-vendor.drv /nix/store/24rraxkck3sip5n8ckyl5nrak0fvyikr …
setup:
these 3 derivations will be built:
  /nix/store/4zl7vd195knydmjxwfjbcqkx3wkfjj3w-lean-ctx-3.11.4-vendor.drv
  /nix/store/24rraxkck3sip5n8ckyl5nrak0fvyikr-lean-ctx-3.11.4.drv
  /nix/store/945kxsl072hp3169xg1a21fvqqj3nb8z-check-lean-ctx.drv
error: timed out after 1200 seconds
error: Cannot build '/nix/store/945kxsl072hp3169xg1a21fvqqj3nb8z-check-lean-ctx.drv'.
       Reason: 1 dependency failed.
       Output paths:
         /nix/store/chyhij4kkk0cv3lgfd7qbx1qyq7hl2s3-check-lean-ctx
failed checks.x86_64-linux.pkgs-mistral-vibe 36m 44s
setup: /nix/store/0m7bg2ckdyyyj63f0clx505hqgnf7z0k-python3.14-tree-sitter-python-0.25.0 /nix/store/rxl75i4g51azgaf56pwrj93kfawbdkdb-python3.14-zstandard-0.2 …
setup:
  /nix/store/0m7bg2ckdyyyj63f0clx505hqgnf7z0k-python3.14-tree-sitter-python-0.25.0
  /nix/store/rxl75i4g51azgaf56pwrj93kfawbdkdb-python3.14-zstandard-0.25.0
error: timed out after 1200 seconds
error: Cannot build '/nix/store/6b0jfir68snfmcliw7qcywh9q882gnpi-python3.14-humanize-4.16.0.drv'.
       Reason: 1 dependency failed.
       Output paths:
         /nix/store/j3swgz0rx33d24z30ka769jzf09cwfhw-python3.14-humanize-4.16.0
         /nix/store/lr5wl7in7ain60pgjhd89h3p4afsv63i-python3.14-humanize-4.16.0-dist
error: Cannot build '/nix/store/j051kp2gn6nnb1aic0hc9zlwav97l29d-python3.14-jsonpath-python-1.1.6.drv'.
       Reason: 1 dependency failed.
       Output paths:
         /nix/store/lvz8sv2pjyc9cs5wc80afh6hm43bigbv-python3.14-jsonpath-python-1.1.6-dist
         /nix/store/mi6lz9a764csf9vsy8z4ja0f91lanihn-python3.14-jsonpath-python-1.1.6
error: Cannot build '/nix/store/9q1czr7av2xpd8dlhd2pillxxc6rj7z9-python3.14-mistralai-2.6.0.drv'.
       Reason: 1 dependency failed.
       Output paths:
         /nix/store/az5g1kph55fz9a262ksdm008bbcx3vyv-python3.14-mistralai-2.6.0
         /nix/store/kw18klj7gja2zkqkj8cqdlncihhc2606-python3.14-mistralai-2.6.0-dist
error: Cannot build '/nix/store/hwh35mlzbgh9qv5kbqk8xznclcnzx5ra-mistral-vibe-3.0.0.drv'.
       Reason: 2 dependencies failed.
       Output paths:
         /nix/store/p77ncfkwpj6kd7lxvvmacxgjsmybfwxw-mistral-vibe-3.0.0-dist
         /nix/store/q62i2nh2njrcvxjlgvcgm8kkhwhjl681-mistral-vibe-3.0.0
error: Cannot build '/nix/store/vss1fhrrciaynwwd88rq0smzanflsxrl-check-mistral-vibe.drv'.
       Reason: 1 dependency failed.
       Output paths:
         /nix/store/2w4q1n994xlajx3w4gyczgy0pg89qwfs-check-mistral-vibe
failed checks.x86_64-linux.pkgs-openclaw 47m 11s
openclaw-2026.9.5: at async withDistArtifactOwnership (/build/source/scripts/lib/dist-artifact-ownership.mts:53:12) at async writeTsdownDeclarations (/b …
openclaw-2026.9.5:
    at async withDistArtifactOwnership (/build/source/scripts/lib/dist-artifact-ownership.mts:53:12)
    at async writeTsdownDeclarations (/build/source/scripts/lib/tsdown-declaration-writer.mts:46:5)
    at async <anonymous> (/build/source/scripts/write-unified-entry-dts.ts:5:1) {
  exitCode: 1
}
[build-all] write-unified-entry-dts failed after 31m 12.2s
[build-all] phase timings: total 38m 24.2s; slowest write-unified-entry-dts (failed) 31m 12.2s; tsdown-unified 3m 29.3s; tsdown-packages 2m 36.6s; tsdown-ai 44.3s; plugins:assets:build 21.7s
 ELIFECYCLE  Command failed with exit code 1.
failed checks.x86_64-linux.pkgs-orbi-cli 14s
orbi-cli-0.7.10: 264 _callImplicitHook /nix/store/an9g93vg5b02j74y38zfajswa0f10p2z-stdenv-linux/setup 281 _eval /nix/store/an9g93vg5b02j74y38zfajswa0f10p2z-stde …
orbi-cli-0.7.10:
264 _callImplicitHook /nix/store/an9g93vg5b02j74y38zfajswa0f10p2z-stdenv-linux/setup
281 _eval /nix/store/an9g93vg5b02j74y38zfajswa0f10p2z-stdenv-linux/setup
220 runHook /nix/store/an9g93vg5b02j74y38zfajswa0f10p2z-stdenv-linux/setup
1666 fixupPhase /nix/store/an9g93vg5b02j74y38zfajswa0f10p2z-stdenv-linux/setup
1771 runPhase /nix/store/an9g93vg5b02j74y38zfajswa0f10p2z-stdenv-linux/setup
1826 genericBuild /nix/store/an9g93vg5b02j74y38zfajswa0f10p2z-stdenv-linux/setup
1 source /nix/store/shkw4qm9qcw5sc5n1k5jznc83ny02r39-default-builder.sh
3 main /nix/store/l622p70vy8k5sh7y5wizi5f2mic6ynpg-source-stdenv.sh
173 succeeded
succeeded attributes
status attribute duration
loading…
494 already built
skipped attributes
status attribute duration
loading…