python3.14-slack-bolt-1.30.0
checks.aarch64-darwin.pkgs-hermes-desktop
· build #7976
· raw
1mac02: building nkd71zyzxcv06mgf93naib0z9srxrf2n-python3.14-slack-bolt-1.30.0.drv2Sourcing python-remove-tests-dir-hook3Sourcing python-catch-conflicts-hook.sh4Sourcing python-remove-bin-bytecode-hook.sh5Sourcing pypa-build-hook6Using pypaBuildPhase7Sourcing python-runtime-deps-check-hook8Using pythonRuntimeDepsCheckHook9Sourcing pypa-install-hook10Using pypaInstallPhase11Sourcing python-imports-check-hook.sh12Using pythonImportsCheckPhase13Sourcing python-metadata-check-hook.sh14Using pythonMetadataCheckPhase15Sourcing python-namespaces-hook16Sourcing python-catch-conflicts-hook.sh17Sourcing pytest-check-hook18Using pytestCheckPhase
unpackPhase
19unpacking source archive /nix/store/ih4xadhjgrwshiip3ks0cfx1hg56kmvc-source20source root is source21setting SOURCE_DATE_EPOCH to timestamp 315619200 of file "source/tests/utils.py"configurePhase
22no configure script, doing nothingbuildPhase
23Executing pypaBuildPhase24Creating a wheel...25pypa build flags: --no-isolation --outdir dist/ --wheel26* Getting build dependencies for wheel...27/nix/store/cp6vhcyg8bna8rrmnamn75ii070diafk-python3.14-setuptools-83.0.0/lib/python3.14/site-packages/setuptools/config/pyprojecttoml.py:72: _ExperimentalConfiguration: `[tool.distutils]` in `pyproject.toml` is still *experimental* and likely to change in future releases.28 config = read_configuration(filepath, True, ignore_option_errors, dist)29/nix/store/cp6vhcyg8bna8rrmnamn75ii070diafk-python3.14-setuptools-83.0.0/lib/python3.14/site-packages/setuptools/config/_apply_pyprojecttoml.py:82: SetuptoolsDeprecationWarning: `project.license` as a TOML table is deprecated30!!3132 ********************************************************************************33 Please use a simple string containing a SPDX expression for `project.license`. You can also use `project.license-files`. (Both options available on setuptools>=77.0.0).3435 By 2027-Feb-18, you need to update your project and remove deprecated calls36 or your builds will no longer be supported.3738 See https://packaging.python.org/en/latest/guides/writing-pyproject-toml/#license for details.39 ********************************************************************************4041!!42 corresp(dist, value, root_dir)43/nix/store/cp6vhcyg8bna8rrmnamn75ii070diafk-python3.14-setuptools-83.0.0/lib/python3.14/site-packages/setuptools/config/_apply_pyprojecttoml.py:61: SetuptoolsDeprecationWarning: License classifiers are deprecated.44!!4546 ********************************************************************************47 Please consider removing the following classifiers in favor of a SPDX license expression:4849 License :: OSI Approved :: MIT License5051 See https://packaging.python.org/en/latest/guides/writing-pyproject-toml/#license for details.52 ********************************************************************************5354!!55 dist._finalize_license_expression()56/nix/store/cp6vhcyg8bna8rrmnamn75ii070diafk-python3.14-setuptools-83.0.0/lib/python3.14/site-packages/setuptools/dist.py:765: SetuptoolsDeprecationWarning: License classifiers are deprecated.57!!5859 ********************************************************************************60 Please consider removing the following classifiers in favor of a SPDX license expression:6162 License :: OSI Approved :: MIT License6364 See https://packaging.python.org/en/latest/guides/writing-pyproject-toml/#license for details.65 ********************************************************************************6667!!68 self._finalize_license_expression()69running egg_info70creating slack_bolt.egg-info71writing slack_bolt.egg-info/PKG-INFO72writing dependency_links to slack_bolt.egg-info/dependency_links.txt73writing requirements to slack_bolt.egg-info/requires.txt74writing top-level names to slack_bolt.egg-info/top_level.txt75writing manifest file 'slack_bolt.egg-info/SOURCES.txt'76reading manifest file 'slack_bolt.egg-info/SOURCES.txt'77reading manifest template 'MANIFEST.in'78adding license file 'LICENSE'79writing manifest file 'slack_bolt.egg-info/SOURCES.txt'80* Building wheel...81/nix/store/cp6vhcyg8bna8rrmnamn75ii070diafk-python3.14-setuptools-83.0.0/lib/python3.14/site-packages/setuptools/config/pyprojecttoml.py:72: _ExperimentalConfiguration: `[tool.distutils]` in `pyproject.toml` is still *experimental* and likely to change in future releases.82 config = read_configuration(filepath, True, ignore_option_errors, dist)83/nix/store/cp6vhcyg8bna8rrmnamn75ii070diafk-python3.14-setuptools-83.0.0/lib/python3.14/site-packages/setuptools/config/_apply_pyprojecttoml.py:82: SetuptoolsDeprecationWarning: `project.license` as a TOML table is deprecated84!!8586 ********************************************************************************87 Please use a simple string containing a SPDX expression for `project.license`. You can also use `project.license-files`. (Both options available on setuptools>=77.0.0).8889 By 2027-Feb-18, you need to update your project and remove deprecated calls90 or your builds will no longer be supported.9192 See https://packaging.python.org/en/latest/guides/writing-pyproject-toml/#license for details.93 ********************************************************************************9495!!96 corresp(dist, value, root_dir)97/nix/store/cp6vhcyg8bna8rrmnamn75ii070diafk-python3.14-setuptools-83.0.0/lib/python3.14/site-packages/setuptools/config/_apply_pyprojecttoml.py:61: SetuptoolsDeprecationWarning: License classifiers are deprecated.98!!99100 ********************************************************************************101 Please consider removing the following classifiers in favor of a SPDX license expression:102103 License :: OSI Approved :: MIT License104105 See https://packaging.python.org/en/latest/guides/writing-pyproject-toml/#license for details.106 ********************************************************************************107108!!109 dist._finalize_license_expression()110/nix/store/cp6vhcyg8bna8rrmnamn75ii070diafk-python3.14-setuptools-83.0.0/lib/python3.14/site-packages/setuptools/dist.py:765: SetuptoolsDeprecationWarning: License classifiers are deprecated.111!!112113 ********************************************************************************114 Please consider removing the following classifiers in favor of a SPDX license expression:115116 License :: OSI Approved :: MIT License117118 See https://packaging.python.org/en/latest/guides/writing-pyproject-toml/#license for details.119 ********************************************************************************120121!!122 self._finalize_license_expression()123running bdist_wheel124/nix/store/cp6vhcyg8bna8rrmnamn75ii070diafk-python3.14-setuptools-83.0.0/lib/python3.14/site-packages/setuptools/_distutils/cmd.py:119: SetuptoolsDeprecationWarning: bdist_wheel.universal is deprecated125!!126127 ********************************************************************************128 With Python 2.7 end-of-life, support for building universal wheels129 (i.e., wheels that support both Python 2 and Python 3)130 is being obviated.131 Please discontinue using this option, or if you still need it,132 file an issue with pypa/setuptools describing your use case.133134 This deprecation is overdue, please update your project and remove deprecated135 calls to avoid build errors in the future.136 ********************************************************************************137138!!139 self.finalize_options()140running build141running build_py142creating build/lib/slack_bolt143copying slack_bolt/version.py -> build/lib/slack_bolt144copying slack_bolt/__init__.py -> build/lib/slack_bolt145copying slack_bolt/async_app.py -> build/lib/slack_bolt146creating build/lib/slack_bolt/lazy_listener147copying slack_bolt/lazy_listener/runner.py -> build/lib/slack_bolt/lazy_listener148copying slack_bolt/lazy_listener/internals.py -> build/lib/slack_bolt/lazy_listener149copying slack_bolt/lazy_listener/thread_runner.py -> build/lib/slack_bolt/lazy_listener150copying slack_bolt/lazy_listener/__init__.py -> build/lib/slack_bolt/lazy_listener151copying slack_bolt/lazy_listener/async_internals.py -> build/lib/slack_bolt/lazy_listener152copying slack_bolt/lazy_listener/asyncio_runner.py -> build/lib/slack_bolt/lazy_listener153copying slack_bolt/lazy_listener/async_runner.py -> build/lib/slack_bolt/lazy_listener154creating build/lib/slack_bolt/middleware155copying slack_bolt/middleware/middleware_error_handler.py -> build/lib/slack_bolt/middleware156copying slack_bolt/middleware/async_builtins.py -> build/lib/slack_bolt/middleware157copying slack_bolt/middleware/async_middleware.py -> build/lib/slack_bolt/middleware158copying slack_bolt/middleware/__init__.py -> build/lib/slack_bolt/middleware159copying slack_bolt/middleware/async_middleware_error_handler.py -> build/lib/slack_bolt/middleware160copying slack_bolt/middleware/custom_middleware.py -> build/lib/slack_bolt/middleware161copying slack_bolt/middleware/middleware.py -> build/lib/slack_bolt/middleware162copying slack_bolt/middleware/async_custom_middleware.py -> build/lib/slack_bolt/middleware163creating build/lib/slack_bolt/listener164copying slack_bolt/listener/async_builtins.py -> build/lib/slack_bolt/listener165copying slack_bolt/listener/async_listener_error_handler.py -> build/lib/slack_bolt/listener166copying slack_bolt/listener/builtins.py -> build/lib/slack_bolt/listener167copying slack_bolt/listener/async_listener_start_handler.py -> build/lib/slack_bolt/listener168copying slack_bolt/listener/thread_runner.py -> build/lib/slack_bolt/listener169copying slack_bolt/listener/__init__.py -> build/lib/slack_bolt/listener170copying slack_bolt/listener/custom_listener.py -> build/lib/slack_bolt/listener171copying slack_bolt/listener/async_listener.py -> build/lib/slack_bolt/listener172copying slack_bolt/listener/async_listener_completion_handler.py -> build/lib/slack_bolt/listener173copying slack_bolt/listener/listener_start_handler.py -> build/lib/slack_bolt/listener174copying slack_bolt/listener/listener_error_handler.py -> build/lib/slack_bolt/listener175copying slack_bolt/listener/asyncio_runner.py -> build/lib/slack_bolt/listener176copying slack_bolt/listener/listener_completion_handler.py -> build/lib/slack_bolt/listener177copying slack_bolt/listener/listener.py -> build/lib/slack_bolt/listener178creating build/lib/slack_bolt/context179copying slack_bolt/context/base_context.py -> build/lib/slack_bolt/context180copying slack_bolt/context/__init__.py -> build/lib/slack_bolt/context181copying slack_bolt/context/async_context.py -> build/lib/slack_bolt/context182copying slack_bolt/context/context.py -> build/lib/slack_bolt/context183creating build/lib/slack_bolt/oauth184copying slack_bolt/oauth/internals.py -> build/lib/slack_bolt/oauth185copying slack_bolt/oauth/async_oauth_flow.py -> build/lib/slack_bolt/oauth186copying slack_bolt/oauth/__init__.py -> build/lib/slack_bolt/oauth187copying slack_bolt/oauth/async_oauth_settings.py -> build/lib/slack_bolt/oauth188copying slack_bolt/oauth/async_callback_options.py -> build/lib/slack_bolt/oauth189copying slack_bolt/oauth/oauth_flow.py -> build/lib/slack_bolt/oauth190copying slack_bolt/oauth/async_internals.py -> build/lib/slack_bolt/oauth191copying slack_bolt/oauth/oauth_settings.py -> build/lib/slack_bolt/oauth192copying slack_bolt/oauth/callback_options.py -> build/lib/slack_bolt/oauth193creating build/lib/slack_bolt/logger194copying slack_bolt/logger/__init__.py -> build/lib/slack_bolt/logger195copying slack_bolt/logger/messages.py -> build/lib/slack_bolt/logger196creating build/lib/slack_bolt/app197copying slack_bolt/app/__init__.py -> build/lib/slack_bolt/app198copying slack_bolt/app/app.py -> build/lib/slack_bolt/app199copying slack_bolt/app/async_server.py -> build/lib/slack_bolt/app200copying slack_bolt/app/async_app.py -> build/lib/slack_bolt/app201creating build/lib/slack_bolt/response202copying slack_bolt/response/__init__.py -> build/lib/slack_bolt/response203copying slack_bolt/response/response.py -> build/lib/slack_bolt/response204creating build/lib/slack_bolt/util205copying slack_bolt/util/async_utils.py -> build/lib/slack_bolt/util206copying slack_bolt/util/__init__.py -> build/lib/slack_bolt/util207copying slack_bolt/util/utils.py -> build/lib/slack_bolt/util208creating build/lib/slack_bolt/workflows209copying slack_bolt/workflows/__init__.py -> build/lib/slack_bolt/workflows210creating build/lib/slack_bolt/listener_matcher211copying slack_bolt/listener_matcher/async_builtins.py -> build/lib/slack_bolt/listener_matcher212copying slack_bolt/listener_matcher/builtins.py -> build/lib/slack_bolt/listener_matcher213copying slack_bolt/listener_matcher/listener_matcher.py -> build/lib/slack_bolt/listener_matcher214copying slack_bolt/listener_matcher/__init__.py -> build/lib/slack_bolt/listener_matcher215copying slack_bolt/listener_matcher/async_listener_matcher.py -> build/lib/slack_bolt/listener_matcher216copying slack_bolt/listener_matcher/custom_listener_matcher.py -> build/lib/slack_bolt/listener_matcher217creating build/lib/slack_bolt/adapter218copying slack_bolt/adapter/__init__.py -> build/lib/slack_bolt/adapter219creating build/lib/slack_bolt/kwargs_injection220copying slack_bolt/kwargs_injection/async_utils.py -> build/lib/slack_bolt/kwargs_injection221copying slack_bolt/kwargs_injection/__init__.py -> build/lib/slack_bolt/kwargs_injection222copying slack_bolt/kwargs_injection/utils.py -> build/lib/slack_bolt/kwargs_injection223copying slack_bolt/kwargs_injection/args.py -> build/lib/slack_bolt/kwargs_injection224copying slack_bolt/kwargs_injection/async_args.py -> build/lib/slack_bolt/kwargs_injection225creating build/lib/slack_bolt/request226copying slack_bolt/request/internals.py -> build/lib/slack_bolt/request227copying slack_bolt/request/request.py -> build/lib/slack_bolt/request228copying slack_bolt/request/payload_utils.py -> build/lib/slack_bolt/request229copying slack_bolt/request/__init__.py -> build/lib/slack_bolt/request230copying slack_bolt/request/async_request.py -> build/lib/slack_bolt/request231copying slack_bolt/request/async_internals.py -> build/lib/slack_bolt/request232creating build/lib/slack_bolt/authorization233copying slack_bolt/authorization/authorize_result.py -> build/lib/slack_bolt/authorization234copying slack_bolt/authorization/authorize.py -> build/lib/slack_bolt/authorization235copying slack_bolt/authorization/authorize_args.py -> build/lib/slack_bolt/authorization236copying slack_bolt/authorization/__init__.py -> build/lib/slack_bolt/authorization237copying slack_bolt/authorization/async_authorize.py -> build/lib/slack_bolt/authorization238copying slack_bolt/authorization/async_authorize_args.py -> build/lib/slack_bolt/authorization239creating build/lib/slack_bolt/error240copying slack_bolt/error/__init__.py -> build/lib/slack_bolt/error241creating build/lib/slack_bolt/middleware/assistant242copying slack_bolt/middleware/assistant/assistant.py -> build/lib/slack_bolt/middleware/assistant243copying slack_bolt/middleware/assistant/__init__.py -> build/lib/slack_bolt/middleware/assistant244copying slack_bolt/middleware/assistant/async_assistant.py -> build/lib/slack_bolt/middleware/assistant245creating build/lib/slack_bolt/middleware/url_verification246copying slack_bolt/middleware/url_verification/__init__.py -> build/lib/slack_bolt/middleware/url_verification247copying slack_bolt/middleware/url_verification/url_verification.py -> build/lib/slack_bolt/middleware/url_verification248copying slack_bolt/middleware/url_verification/async_url_verification.py -> build/lib/slack_bolt/middleware/url_verification249creating build/lib/slack_bolt/middleware/ssl_check250copying slack_bolt/middleware/ssl_check/async_ssl_check.py -> build/lib/slack_bolt/middleware/ssl_check251copying slack_bolt/middleware/ssl_check/__init__.py -> build/lib/slack_bolt/middleware/ssl_check252copying slack_bolt/middleware/ssl_check/ssl_check.py -> build/lib/slack_bolt/middleware/ssl_check253creating build/lib/slack_bolt/middleware/attaching_function_token254copying slack_bolt/middleware/attaching_function_token/__init__.py -> build/lib/slack_bolt/middleware/attaching_function_token255copying slack_bolt/middleware/attaching_function_token/async_attaching_function_token.py -> build/lib/slack_bolt/middleware/attaching_function_token256copying slack_bolt/middleware/attaching_function_token/attaching_function_token.py -> build/lib/slack_bolt/middleware/attaching_function_token257creating build/lib/slack_bolt/middleware/ignoring_self_events258copying slack_bolt/middleware/ignoring_self_events/async_ignoring_self_events.py -> build/lib/slack_bolt/middleware/ignoring_self_events259copying slack_bolt/middleware/ignoring_self_events/__init__.py -> build/lib/slack_bolt/middleware/ignoring_self_events260copying slack_bolt/middleware/ignoring_self_events/ignoring_self_events.py -> build/lib/slack_bolt/middleware/ignoring_self_events261creating build/lib/slack_bolt/middleware/message_listener_matches262copying slack_bolt/middleware/message_listener_matches/async_message_listener_matches.py -> build/lib/slack_bolt/middleware/message_listener_matches263copying slack_bolt/middleware/message_listener_matches/__init__.py -> build/lib/slack_bolt/middleware/message_listener_matches264copying slack_bolt/middleware/message_listener_matches/message_listener_matches.py -> build/lib/slack_bolt/middleware/message_listener_matches265creating build/lib/slack_bolt/middleware/request_verification266copying slack_bolt/middleware/request_verification/request_verification.py -> build/lib/slack_bolt/middleware/request_verification267copying slack_bolt/middleware/request_verification/__init__.py -> build/lib/slack_bolt/middleware/request_verification268copying slack_bolt/middleware/request_verification/async_request_verification.py -> build/lib/slack_bolt/middleware/request_verification269creating build/lib/slack_bolt/middleware/authorization270copying slack_bolt/middleware/authorization/async_multi_teams_authorization.py -> build/lib/slack_bolt/middleware/authorization271copying slack_bolt/middleware/authorization/internals.py -> build/lib/slack_bolt/middleware/authorization272copying slack_bolt/middleware/authorization/multi_teams_authorization.py -> build/lib/slack_bolt/middleware/authorization273copying slack_bolt/middleware/authorization/__init__.py -> build/lib/slack_bolt/middleware/authorization274copying slack_bolt/middleware/authorization/async_authorization.py -> build/lib/slack_bolt/middleware/authorization275copying slack_bolt/middleware/authorization/single_team_authorization.py -> build/lib/slack_bolt/middleware/authorization276copying slack_bolt/middleware/authorization/authorization.py -> build/lib/slack_bolt/middleware/authorization277copying slack_bolt/middleware/authorization/async_single_team_authorization.py -> build/lib/slack_bolt/middleware/authorization278copying slack_bolt/middleware/authorization/async_internals.py -> build/lib/slack_bolt/middleware/authorization279creating build/lib/slack_bolt/middleware/attaching_conversation_kwargs280copying slack_bolt/middleware/attaching_conversation_kwargs/__init__.py -> build/lib/slack_bolt/middleware/attaching_conversation_kwargs281copying slack_bolt/middleware/attaching_conversation_kwargs/async_attaching_conversation_kwargs.py -> build/lib/slack_bolt/middleware/attaching_conversation_kwargs282copying slack_bolt/middleware/attaching_conversation_kwargs/attaching_conversation_kwargs.py -> build/lib/slack_bolt/middleware/attaching_conversation_kwargs283creating build/lib/slack_bolt/context/assistant284copying slack_bolt/context/assistant/internals.py -> build/lib/slack_bolt/context/assistant285copying slack_bolt/context/assistant/assistant_utilities.py -> build/lib/slack_bolt/context/assistant286copying slack_bolt/context/assistant/async_assistant_utilities.py -> build/lib/slack_bolt/context/assistant287copying slack_bolt/context/assistant/__init__.py -> build/lib/slack_bolt/context/assistant288creating build/lib/slack_bolt/context/set_status289copying slack_bolt/context/set_status/async_set_status.py -> build/lib/slack_bolt/context/set_status290copying slack_bolt/context/set_status/__init__.py -> build/lib/slack_bolt/context/set_status291copying slack_bolt/context/set_status/set_status.py -> build/lib/slack_bolt/context/set_status292creating build/lib/slack_bolt/context/say293copying slack_bolt/context/say/async_say.py -> build/lib/slack_bolt/context/say294copying slack_bolt/context/say/internals.py -> build/lib/slack_bolt/context/say295copying slack_bolt/context/say/say.py -> build/lib/slack_bolt/context/say296copying slack_bolt/context/say/__init__.py -> build/lib/slack_bolt/context/say297creating build/lib/slack_bolt/context/fail298copying slack_bolt/context/fail/__init__.py -> build/lib/slack_bolt/context/fail299copying slack_bolt/context/fail/fail.py -> build/lib/slack_bolt/context/fail300copying slack_bolt/context/fail/async_fail.py -> build/lib/slack_bolt/context/fail301creating build/lib/slack_bolt/context/complete302copying slack_bolt/context/complete/__init__.py -> build/lib/slack_bolt/context/complete303copying slack_bolt/context/complete/complete.py -> build/lib/slack_bolt/context/complete304copying slack_bolt/context/complete/async_complete.py -> build/lib/slack_bolt/context/complete305creating build/lib/slack_bolt/context/set_suggested_prompts306copying slack_bolt/context/set_suggested_prompts/__init__.py -> build/lib/slack_bolt/context/set_suggested_prompts307copying slack_bolt/context/set_suggested_prompts/set_suggested_prompts.py -> build/lib/slack_bolt/context/set_suggested_prompts308copying slack_bolt/context/set_suggested_prompts/async_set_suggested_prompts.py -> build/lib/slack_bolt/context/set_suggested_prompts309creating build/lib/slack_bolt/context/say_stream310copying slack_bolt/context/say_stream/async_say_stream.py -> build/lib/slack_bolt/context/say_stream311copying slack_bolt/context/say_stream/__init__.py -> build/lib/slack_bolt/context/say_stream312copying slack_bolt/context/say_stream/say_stream.py -> build/lib/slack_bolt/context/say_stream313creating build/lib/slack_bolt/context/get_thread_context314copying slack_bolt/context/get_thread_context/get_thread_context.py -> build/lib/slack_bolt/context/get_thread_context315copying slack_bolt/context/get_thread_context/async_get_thread_context.py -> build/lib/slack_bolt/context/get_thread_context316copying slack_bolt/context/get_thread_context/__init__.py -> build/lib/slack_bolt/context/get_thread_context317creating build/lib/slack_bolt/context/respond318copying slack_bolt/context/respond/internals.py -> build/lib/slack_bolt/context/respond319copying slack_bolt/context/respond/respond.py -> build/lib/slack_bolt/context/respond320copying slack_bolt/context/respond/__init__.py -> build/lib/slack_bolt/context/respond321copying slack_bolt/context/respond/async_respond.py -> build/lib/slack_bolt/context/respond322creating build/lib/slack_bolt/context/set_title323copying slack_bolt/context/set_title/async_set_title.py -> build/lib/slack_bolt/context/set_title324copying slack_bolt/context/set_title/__init__.py -> build/lib/slack_bolt/context/set_title325copying slack_bolt/context/set_title/set_title.py -> build/lib/slack_bolt/context/set_title326creating build/lib/slack_bolt/context/ack327copying slack_bolt/context/ack/internals.py -> build/lib/slack_bolt/context/ack328copying slack_bolt/context/ack/async_ack.py -> build/lib/slack_bolt/context/ack329copying slack_bolt/context/ack/ack.py -> build/lib/slack_bolt/context/ack330copying slack_bolt/context/ack/__init__.py -> build/lib/slack_bolt/context/ack331creating build/lib/slack_bolt/context/save_thread_context332copying slack_bolt/context/save_thread_context/__init__.py -> build/lib/slack_bolt/context/save_thread_context333copying slack_bolt/context/save_thread_context/save_thread_context.py -> build/lib/slack_bolt/context/save_thread_context334copying slack_bolt/context/save_thread_context/async_save_thread_context.py -> build/lib/slack_bolt/context/save_thread_context335creating build/lib/slack_bolt/context/assistant/thread_context_store336copying slack_bolt/context/assistant/thread_context_store/store.py -> build/lib/slack_bolt/context/assistant/thread_context_store337copying slack_bolt/context/assistant/thread_context_store/__init__.py -> build/lib/slack_bolt/context/assistant/thread_context_store338copying slack_bolt/context/assistant/thread_context_store/default_async_store.py -> build/lib/slack_bolt/context/assistant/thread_context_store339copying slack_bolt/context/assistant/thread_context_store/async_store.py -> build/lib/slack_bolt/context/assistant/thread_context_store340copying slack_bolt/context/assistant/thread_context_store/default_store.py -> build/lib/slack_bolt/context/assistant/thread_context_store341creating build/lib/slack_bolt/context/assistant/thread_context342copying slack_bolt/context/assistant/thread_context/__init__.py -> build/lib/slack_bolt/context/assistant/thread_context343creating build/lib/slack_bolt/context/assistant/thread_context_store/file344copying slack_bolt/context/assistant/thread_context_store/file/__init__.py -> build/lib/slack_bolt/context/assistant/thread_context_store/file345creating build/lib/slack_bolt/workflows/step346copying slack_bolt/workflows/step/internals.py -> build/lib/slack_bolt/workflows/step347copying slack_bolt/workflows/step/__init__.py -> build/lib/slack_bolt/workflows/step348copying slack_bolt/workflows/step/step.py -> build/lib/slack_bolt/workflows/step349copying slack_bolt/workflows/step/async_step_middleware.py -> build/lib/slack_bolt/workflows/step350copying slack_bolt/workflows/step/step_middleware.py -> build/lib/slack_bolt/workflows/step351copying slack_bolt/workflows/step/async_step.py -> build/lib/slack_bolt/workflows/step352creating build/lib/slack_bolt/workflows/step/utilities353copying slack_bolt/workflows/step/utilities/update.py -> build/lib/slack_bolt/workflows/step/utilities354copying slack_bolt/workflows/step/utilities/configure.py -> build/lib/slack_bolt/workflows/step/utilities355copying slack_bolt/workflows/step/utilities/__init__.py -> build/lib/slack_bolt/workflows/step/utilities356copying slack_bolt/workflows/step/utilities/fail.py -> build/lib/slack_bolt/workflows/step/utilities357copying slack_bolt/workflows/step/utilities/complete.py -> build/lib/slack_bolt/workflows/step/utilities358copying slack_bolt/workflows/step/utilities/async_configure.py -> build/lib/slack_bolt/workflows/step/utilities359copying slack_bolt/workflows/step/utilities/async_fail.py -> build/lib/slack_bolt/workflows/step/utilities360copying slack_bolt/workflows/step/utilities/async_complete.py -> build/lib/slack_bolt/workflows/step/utilities361copying slack_bolt/workflows/step/utilities/async_update.py -> build/lib/slack_bolt/workflows/step/utilities362creating build/lib/slack_bolt/adapter/flask363copying slack_bolt/adapter/flask/handler.py -> build/lib/slack_bolt/adapter/flask364copying slack_bolt/adapter/flask/__init__.py -> build/lib/slack_bolt/adapter/flask365creating build/lib/slack_bolt/adapter/aiohttp366copying slack_bolt/adapter/aiohttp/__init__.py -> build/lib/slack_bolt/adapter/aiohttp367creating build/lib/slack_bolt/adapter/asgi368copying slack_bolt/adapter/asgi/http_response.py -> build/lib/slack_bolt/adapter/asgi369copying slack_bolt/adapter/asgi/__init__.py -> build/lib/slack_bolt/adapter/asgi370copying slack_bolt/adapter/asgi/utils.py -> build/lib/slack_bolt/adapter/asgi371copying slack_bolt/adapter/asgi/base_handler.py -> build/lib/slack_bolt/adapter/asgi372copying slack_bolt/adapter/asgi/async_handler.py -> build/lib/slack_bolt/adapter/asgi373copying slack_bolt/adapter/asgi/http_request.py -> build/lib/slack_bolt/adapter/asgi374creating build/lib/slack_bolt/adapter/pyramid375copying slack_bolt/adapter/pyramid/handler.py -> build/lib/slack_bolt/adapter/pyramid376copying slack_bolt/adapter/pyramid/__init__.py -> build/lib/slack_bolt/adapter/pyramid377creating build/lib/slack_bolt/adapter/starlette378copying slack_bolt/adapter/starlette/handler.py -> build/lib/slack_bolt/adapter/starlette379copying slack_bolt/adapter/starlette/__init__.py -> build/lib/slack_bolt/adapter/starlette380copying slack_bolt/adapter/starlette/async_handler.py -> build/lib/slack_bolt/adapter/starlette381creating build/lib/slack_bolt/adapter/wsgi382copying slack_bolt/adapter/wsgi/internals.py -> build/lib/slack_bolt/adapter/wsgi383copying slack_bolt/adapter/wsgi/handler.py -> build/lib/slack_bolt/adapter/wsgi384copying slack_bolt/adapter/wsgi/http_response.py -> build/lib/slack_bolt/adapter/wsgi385copying slack_bolt/adapter/wsgi/__init__.py -> build/lib/slack_bolt/adapter/wsgi386copying slack_bolt/adapter/wsgi/http_request.py -> build/lib/slack_bolt/adapter/wsgi387creating build/lib/slack_bolt/adapter/cherrypy388copying slack_bolt/adapter/cherrypy/handler.py -> build/lib/slack_bolt/adapter/cherrypy389copying slack_bolt/adapter/cherrypy/__init__.py -> build/lib/slack_bolt/adapter/cherrypy390creating build/lib/slack_bolt/adapter/google_cloud_functions391copying slack_bolt/adapter/google_cloud_functions/handler.py -> build/lib/slack_bolt/adapter/google_cloud_functions392copying slack_bolt/adapter/google_cloud_functions/__init__.py -> build/lib/slack_bolt/adapter/google_cloud_functions393creating build/lib/slack_bolt/adapter/tornado394copying slack_bolt/adapter/tornado/handler.py -> build/lib/slack_bolt/adapter/tornado395copying slack_bolt/adapter/tornado/__init__.py -> build/lib/slack_bolt/adapter/tornado396copying slack_bolt/adapter/tornado/async_handler.py -> build/lib/slack_bolt/adapter/tornado397creating build/lib/slack_bolt/adapter/socket_mode398copying slack_bolt/adapter/socket_mode/async_base_handler.py -> build/lib/slack_bolt/adapter/socket_mode399copying slack_bolt/adapter/socket_mode/internals.py -> build/lib/slack_bolt/adapter/socket_mode400copying slack_bolt/adapter/socket_mode/__init__.py -> build/lib/slack_bolt/adapter/socket_mode401copying slack_bolt/adapter/socket_mode/base_handler.py -> build/lib/slack_bolt/adapter/socket_mode402copying slack_bolt/adapter/socket_mode/async_internals.py -> build/lib/slack_bolt/adapter/socket_mode403copying slack_bolt/adapter/socket_mode/async_handler.py -> build/lib/slack_bolt/adapter/socket_mode404creating build/lib/slack_bolt/adapter/fastapi405copying slack_bolt/adapter/fastapi/__init__.py -> build/lib/slack_bolt/adapter/fastapi406copying slack_bolt/adapter/fastapi/async_handler.py -> build/lib/slack_bolt/adapter/fastapi407creating build/lib/slack_bolt/adapter/sanic408copying slack_bolt/adapter/sanic/__init__.py -> build/lib/slack_bolt/adapter/sanic409copying slack_bolt/adapter/sanic/async_handler.py -> build/lib/slack_bolt/adapter/sanic410creating build/lib/slack_bolt/adapter/aws_lambda411copying slack_bolt/adapter/aws_lambda/chalice_handler.py -> build/lib/slack_bolt/adapter/aws_lambda412copying slack_bolt/adapter/aws_lambda/lambda_s3_oauth_flow.py -> build/lib/slack_bolt/adapter/aws_lambda413copying slack_bolt/adapter/aws_lambda/internals.py -> build/lib/slack_bolt/adapter/aws_lambda414copying slack_bolt/adapter/aws_lambda/handler.py -> build/lib/slack_bolt/adapter/aws_lambda415copying slack_bolt/adapter/aws_lambda/lazy_listener_runner.py -> build/lib/slack_bolt/adapter/aws_lambda416copying slack_bolt/adapter/aws_lambda/local_lambda_client.py -> build/lib/slack_bolt/adapter/aws_lambda417copying slack_bolt/adapter/aws_lambda/__init__.py -> build/lib/slack_bolt/adapter/aws_lambda418copying slack_bolt/adapter/aws_lambda/chalice_lazy_listener_runner.py -> build/lib/slack_bolt/adapter/aws_lambda419creating build/lib/slack_bolt/adapter/django420copying slack_bolt/adapter/django/handler.py -> build/lib/slack_bolt/adapter/django421copying slack_bolt/adapter/django/__init__.py -> build/lib/slack_bolt/adapter/django422creating build/lib/slack_bolt/adapter/falcon423copying slack_bolt/adapter/falcon/async_resource.py -> build/lib/slack_bolt/adapter/falcon424copying slack_bolt/adapter/falcon/resource.py -> build/lib/slack_bolt/adapter/falcon425copying slack_bolt/adapter/falcon/__init__.py -> build/lib/slack_bolt/adapter/falcon426creating build/lib/slack_bolt/adapter/bottle427copying slack_bolt/adapter/bottle/handler.py -> build/lib/slack_bolt/adapter/bottle428copying slack_bolt/adapter/bottle/__init__.py -> build/lib/slack_bolt/adapter/bottle429creating build/lib/slack_bolt/adapter/asgi/aiohttp430copying slack_bolt/adapter/asgi/aiohttp/__init__.py -> build/lib/slack_bolt/adapter/asgi/aiohttp431creating build/lib/slack_bolt/adapter/asgi/builtin432copying slack_bolt/adapter/asgi/builtin/__init__.py -> build/lib/slack_bolt/adapter/asgi/builtin433creating build/lib/slack_bolt/adapter/socket_mode/aiohttp434copying slack_bolt/adapter/socket_mode/aiohttp/__init__.py -> build/lib/slack_bolt/adapter/socket_mode/aiohttp435creating build/lib/slack_bolt/adapter/socket_mode/websocket_client436copying slack_bolt/adapter/socket_mode/websocket_client/__init__.py -> build/lib/slack_bolt/adapter/socket_mode/websocket_client437creating build/lib/slack_bolt/adapter/socket_mode/websockets438copying slack_bolt/adapter/socket_mode/websockets/__init__.py -> build/lib/slack_bolt/adapter/socket_mode/websockets439creating build/lib/slack_bolt/adapter/socket_mode/builtin440copying slack_bolt/adapter/socket_mode/builtin/__init__.py -> build/lib/slack_bolt/adapter/socket_mode/builtin441running egg_info442writing slack_bolt.egg-info/PKG-INFO443writing dependency_links to slack_bolt.egg-info/dependency_links.txt444writing requirements to slack_bolt.egg-info/requires.txt445writing top-level names to slack_bolt.egg-info/top_level.txt446reading manifest file 'slack_bolt.egg-info/SOURCES.txt'447reading manifest template 'MANIFEST.in'448adding license file 'LICENSE'449writing manifest file 'slack_bolt.egg-info/SOURCES.txt'450copying slack_bolt/py.typed -> build/lib/slack_bolt451installing to build/bdist.macosx-14.0-arm64/wheel452running install453running install_lib454creating build/bdist.macosx-14.0-arm64/wheel455creating build/bdist.macosx-14.0-arm64/wheel/slack_bolt456creating build/bdist.macosx-14.0-arm64/wheel/slack_bolt/lazy_listener457copying build/lib/slack_bolt/lazy_listener/runner.py -> build/bdist.macosx-14.0-arm64/wheel/./slack_bolt/lazy_listener458copying build/lib/slack_bolt/lazy_listener/internals.py -> build/bdist.macosx-14.0-arm64/wheel/./slack_bolt/lazy_listener459copying build/lib/slack_bolt/lazy_listener/thread_runner.py -> build/bdist.macosx-14.0-arm64/wheel/./slack_bolt/lazy_listener460copying build/lib/slack_bolt/lazy_listener/__init__.py -> build/bdist.macosx-14.0-arm64/wheel/./slack_bolt/lazy_listener461copying build/lib/slack_bolt/lazy_listener/async_internals.py -> build/bdist.macosx-14.0-arm64/wheel/./slack_bolt/lazy_listener462copying build/lib/slack_bolt/lazy_listener/asyncio_runner.py -> build/bdist.macosx-14.0-arm64/wheel/./slack_bolt/lazy_listener463copying build/lib/slack_bolt/lazy_listener/async_runner.py -> build/bdist.macosx-14.0-arm64/wheel/./slack_bolt/lazy_listener464creating build/bdist.macosx-14.0-arm64/wheel/slack_bolt/middleware465creating build/bdist.macosx-14.0-arm64/wheel/slack_bolt/middleware/assistant466copying build/lib/slack_bolt/middleware/assistant/assistant.py -> build/bdist.macosx-14.0-arm64/wheel/./slack_bolt/middleware/assistant467copying build/lib/slack_bolt/middleware/assistant/__init__.py -> build/bdist.macosx-14.0-arm64/wheel/./slack_bolt/middleware/assistant468copying build/lib/slack_bolt/middleware/assistant/async_assistant.py -> build/bdist.macosx-14.0-arm64/wheel/./slack_bolt/middleware/assistant469copying build/lib/slack_bolt/middleware/middleware_error_handler.py -> build/bdist.macosx-14.0-arm64/wheel/./slack_bolt/middleware470copying build/lib/slack_bolt/middleware/async_builtins.py -> build/bdist.macosx-14.0-arm64/wheel/./slack_bolt/middleware471creating build/bdist.macosx-14.0-arm64/wheel/slack_bolt/middleware/url_verification472copying build/lib/slack_bolt/middleware/url_verification/__init__.py -> build/bdist.macosx-14.0-arm64/wheel/./slack_bolt/middleware/url_verification473copying build/lib/slack_bolt/middleware/url_verification/url_verification.py -> build/bdist.macosx-14.0-arm64/wheel/./slack_bolt/middleware/url_verification474copying build/lib/slack_bolt/middleware/url_verification/async_url_verification.py -> build/bdist.macosx-14.0-arm64/wheel/./slack_bolt/middleware/url_verification475copying build/lib/slack_bolt/middleware/async_middleware.py -> build/bdist.macosx-14.0-arm64/wheel/./slack_bolt/middleware476copying build/lib/slack_bolt/middleware/__init__.py -> build/bdist.macosx-14.0-arm64/wheel/./slack_bolt/middleware477creating build/bdist.macosx-14.0-arm64/wheel/slack_bolt/middleware/ssl_check478copying build/lib/slack_bolt/middleware/ssl_check/async_ssl_check.py -> build/bdist.macosx-14.0-arm64/wheel/./slack_bolt/middleware/ssl_check479copying build/lib/slack_bolt/middleware/ssl_check/__init__.py -> build/bdist.macosx-14.0-arm64/wheel/./slack_bolt/middleware/ssl_check480copying build/lib/slack_bolt/middleware/ssl_check/ssl_check.py -> build/bdist.macosx-14.0-arm64/wheel/./slack_bolt/middleware/ssl_check481creating build/bdist.macosx-14.0-arm64/wheel/slack_bolt/middleware/attaching_function_token482copying build/lib/slack_bolt/middleware/attaching_function_token/__init__.py -> build/bdist.macosx-14.0-arm64/wheel/./slack_bolt/middleware/attaching_function_token483copying build/lib/slack_bolt/middleware/attaching_function_token/async_attaching_function_token.py -> build/bdist.macosx-14.0-arm64/wheel/./slack_bolt/middleware/attaching_function_token484copying build/lib/slack_bolt/middleware/attaching_function_token/attaching_function_token.py -> build/bdist.macosx-14.0-arm64/wheel/./slack_bolt/middleware/attaching_function_token485creating build/bdist.macosx-14.0-arm64/wheel/slack_bolt/middleware/ignoring_self_events486copying build/lib/slack_bolt/middleware/ignoring_self_events/async_ignoring_self_events.py -> build/bdist.macosx-14.0-arm64/wheel/./slack_bolt/middleware/ignoring_self_events487copying build/lib/slack_bolt/middleware/ignoring_self_events/__init__.py -> build/bdist.macosx-14.0-arm64/wheel/./slack_bolt/middleware/ignoring_self_events488copying build/lib/slack_bolt/middleware/ignoring_self_events/ignoring_self_events.py -> build/bdist.macosx-14.0-arm64/wheel/./slack_bolt/middleware/ignoring_self_events489copying build/lib/slack_bolt/middleware/async_middleware_error_handler.py -> build/bdist.macosx-14.0-arm64/wheel/./slack_bolt/middleware490creating build/bdist.macosx-14.0-arm64/wheel/slack_bolt/middleware/message_listener_matches491copying build/lib/slack_bolt/middleware/message_listener_matches/async_message_listener_matches.py -> build/bdist.macosx-14.0-arm64/wheel/./slack_bolt/middleware/message_listener_matches492copying build/lib/slack_bolt/middleware/message_listener_matches/__init__.py -> build/bdist.macosx-14.0-arm64/wheel/./slack_bolt/middleware/message_listener_matches493copying build/lib/slack_bolt/middleware/message_listener_matches/message_listener_matches.py -> build/bdist.macosx-14.0-arm64/wheel/./slack_bolt/middleware/message_listener_matches494creating build/bdist.macosx-14.0-arm64/wheel/slack_bolt/middleware/request_verification495copying build/lib/slack_bolt/middleware/request_verification/request_verification.py -> build/bdist.macosx-14.0-arm64/wheel/./slack_bolt/middleware/request_verification496copying build/lib/slack_bolt/middleware/request_verification/__init__.py -> build/bdist.macosx-14.0-arm64/wheel/./slack_bolt/middleware/request_verification497copying build/lib/slack_bolt/middleware/request_verification/async_request_verification.py -> build/bdist.macosx-14.0-arm64/wheel/./slack_bolt/middleware/request_verification498copying build/lib/slack_bolt/middleware/custom_middleware.py -> build/bdist.macosx-14.0-arm64/wheel/./slack_bolt/middleware499creating build/bdist.macosx-14.0-arm64/wheel/slack_bolt/middleware/authorization500copying build/lib/slack_bolt/middleware/authorization/async_multi_teams_authorization.py -> build/bdist.macosx-14.0-arm64/wheel/./slack_bolt/middleware/authorization501copying build/lib/slack_bolt/middleware/authorization/internals.py -> build/bdist.macosx-14.0-arm64/wheel/./slack_bolt/middleware/authorization502copying build/lib/slack_bolt/middleware/authorization/multi_teams_authorization.py -> build/bdist.macosx-14.0-arm64/wheel/./slack_bolt/middleware/authorization503copying build/lib/slack_bolt/middleware/authorization/__init__.py -> build/bdist.macosx-14.0-arm64/wheel/./slack_bolt/middleware/authorization504copying build/lib/slack_bolt/middleware/authorization/async_authorization.py -> build/bdist.macosx-14.0-arm64/wheel/./slack_bolt/middleware/authorization505copying build/lib/slack_bolt/middleware/authorization/single_team_authorization.py -> build/bdist.macosx-14.0-arm64/wheel/./slack_bolt/middleware/authorization506copying build/lib/slack_bolt/middleware/authorization/authorization.py -> build/bdist.macosx-14.0-arm64/wheel/./slack_bolt/middleware/authorization507copying build/lib/slack_bolt/middleware/authorization/async_single_team_authorization.py -> build/bdist.macosx-14.0-arm64/wheel/./slack_bolt/middleware/authorization508copying build/lib/slack_bolt/middleware/authorization/async_internals.py -> build/bdist.macosx-14.0-arm64/wheel/./slack_bolt/middleware/authorization509copying build/lib/slack_bolt/middleware/middleware.py -> build/bdist.macosx-14.0-arm64/wheel/./slack_bolt/middleware510creating build/bdist.macosx-14.0-arm64/wheel/slack_bolt/middleware/attaching_conversation_kwargs511copying build/lib/slack_bolt/middleware/attaching_conversation_kwargs/__init__.py -> build/bdist.macosx-14.0-arm64/wheel/./slack_bolt/middleware/attaching_conversation_kwargs512copying build/lib/slack_bolt/middleware/attaching_conversation_kwargs/async_attaching_conversation_kwargs.py -> build/bdist.macosx-14.0-arm64/wheel/./slack_bolt/middleware/attaching_conversation_kwargs513copying build/lib/slack_bolt/middleware/attaching_conversation_kwargs/attaching_conversation_kwargs.py -> build/bdist.macosx-14.0-arm64/wheel/./slack_bolt/middleware/attaching_conversation_kwargs514copying build/lib/slack_bolt/middleware/async_custom_middleware.py -> build/bdist.macosx-14.0-arm64/wheel/./slack_bolt/middleware515creating build/bdist.macosx-14.0-arm64/wheel/slack_bolt/listener516copying build/lib/slack_bolt/listener/async_builtins.py -> build/bdist.macosx-14.0-arm64/wheel/./slack_bolt/listener517copying build/lib/slack_bolt/listener/async_listener_error_handler.py -> build/bdist.macosx-14.0-arm64/wheel/./slack_bolt/listener518copying build/lib/slack_bolt/listener/builtins.py -> build/bdist.macosx-14.0-arm64/wheel/./slack_bolt/listener519copying build/lib/slack_bolt/listener/async_listener_start_handler.py -> build/bdist.macosx-14.0-arm64/wheel/./slack_bolt/listener520copying build/lib/slack_bolt/listener/thread_runner.py -> build/bdist.macosx-14.0-arm64/wheel/./slack_bolt/listener521copying build/lib/slack_bolt/listener/__init__.py -> build/bdist.macosx-14.0-arm64/wheel/./slack_bolt/listener522copying build/lib/slack_bolt/listener/custom_listener.py -> build/bdist.macosx-14.0-arm64/wheel/./slack_bolt/listener523copying build/lib/slack_bolt/listener/async_listener.py -> build/bdist.macosx-14.0-arm64/wheel/./slack_bolt/listener524copying build/lib/slack_bolt/listener/async_listener_completion_handler.py -> build/bdist.macosx-14.0-arm64/wheel/./slack_bolt/listener525copying build/lib/slack_bolt/listener/listener_start_handler.py -> build/bdist.macosx-14.0-arm64/wheel/./slack_bolt/listener526copying build/lib/slack_bolt/listener/listener_error_handler.py -> build/bdist.macosx-14.0-arm64/wheel/./slack_bolt/listener527copying build/lib/slack_bolt/listener/asyncio_runner.py -> build/bdist.macosx-14.0-arm64/wheel/./slack_bolt/listener528copying build/lib/slack_bolt/listener/listener_completion_handler.py -> build/bdist.macosx-14.0-arm64/wheel/./slack_bolt/listener529copying build/lib/slack_bolt/listener/listener.py -> build/bdist.macosx-14.0-arm64/wheel/./slack_bolt/listener530creating build/bdist.macosx-14.0-arm64/wheel/slack_bolt/context531creating build/bdist.macosx-14.0-arm64/wheel/slack_bolt/context/assistant532copying build/lib/slack_bolt/context/assistant/internals.py -> build/bdist.macosx-14.0-arm64/wheel/./slack_bolt/context/assistant533copying build/lib/slack_bolt/context/assistant/assistant_utilities.py -> build/bdist.macosx-14.0-arm64/wheel/./slack_bolt/context/assistant534copying build/lib/slack_bolt/context/assistant/async_assistant_utilities.py -> build/bdist.macosx-14.0-arm64/wheel/./slack_bolt/context/assistant535copying build/lib/slack_bolt/context/assistant/__init__.py -> build/bdist.macosx-14.0-arm64/wheel/./slack_bolt/context/assistant536creating build/bdist.macosx-14.0-arm64/wheel/slack_bolt/context/assistant/thread_context_store537copying build/lib/slack_bolt/context/assistant/thread_context_store/store.py -> build/bdist.macosx-14.0-arm64/wheel/./slack_bolt/context/assistant/thread_context_store538creating build/bdist.macosx-14.0-arm64/wheel/slack_bolt/context/assistant/thread_context_store/file539copying build/lib/slack_bolt/context/assistant/thread_context_store/file/__init__.py -> build/bdist.macosx-14.0-arm64/wheel/./slack_bolt/context/assistant/thread_context_store/file540copying build/lib/slack_bolt/context/assistant/thread_context_store/__init__.py -> build/bdist.macosx-14.0-arm64/wheel/./slack_bolt/context/assistant/thread_context_store541copying build/lib/slack_bolt/context/assistant/thread_context_store/default_async_store.py -> build/bdist.macosx-14.0-arm64/wheel/./slack_bolt/context/assistant/thread_context_store542copying build/lib/slack_bolt/context/assistant/thread_context_store/async_store.py -> build/bdist.macosx-14.0-arm64/wheel/./slack_bolt/context/assistant/thread_context_store543copying build/lib/slack_bolt/context/assistant/thread_context_store/default_store.py -> build/bdist.macosx-14.0-arm64/wheel/./slack_bolt/context/assistant/thread_context_store544creating build/bdist.macosx-14.0-arm64/wheel/slack_bolt/context/assistant/thread_context545copying build/lib/slack_bolt/context/assistant/thread_context/__init__.py -> build/bdist.macosx-14.0-arm64/wheel/./slack_bolt/context/assistant/thread_context546copying build/lib/slack_bolt/context/base_context.py -> build/bdist.macosx-14.0-arm64/wheel/./slack_bolt/context547creating build/bdist.macosx-14.0-arm64/wheel/slack_bolt/context/set_status548copying build/lib/slack_bolt/context/set_status/async_set_status.py -> build/bdist.macosx-14.0-arm64/wheel/./slack_bolt/context/set_status549copying build/lib/slack_bolt/context/set_status/__init__.py -> build/bdist.macosx-14.0-arm64/wheel/./slack_bolt/context/set_status550copying build/lib/slack_bolt/context/set_status/set_status.py -> build/bdist.macosx-14.0-arm64/wheel/./slack_bolt/context/set_status551creating build/bdist.macosx-14.0-arm64/wheel/slack_bolt/context/say552copying build/lib/slack_bolt/context/say/async_say.py -> build/bdist.macosx-14.0-arm64/wheel/./slack_bolt/context/say553copying build/lib/slack_bolt/context/say/internals.py -> build/bdist.macosx-14.0-arm64/wheel/./slack_bolt/context/say554copying build/lib/slack_bolt/context/say/say.py -> build/bdist.macosx-14.0-arm64/wheel/./slack_bolt/context/say555copying build/lib/slack_bolt/context/say/__init__.py -> build/bdist.macosx-14.0-arm64/wheel/./slack_bolt/context/say556creating build/bdist.macosx-14.0-arm64/wheel/slack_bolt/context/fail557copying build/lib/slack_bolt/context/fail/__init__.py -> build/bdist.macosx-14.0-arm64/wheel/./slack_bolt/context/fail558copying build/lib/slack_bolt/context/fail/fail.py -> build/bdist.macosx-14.0-arm64/wheel/./slack_bolt/context/fail559copying build/lib/slack_bolt/context/fail/async_fail.py -> build/bdist.macosx-14.0-arm64/wheel/./slack_bolt/context/fail560creating build/bdist.macosx-14.0-arm64/wheel/slack_bolt/context/complete561copying build/lib/slack_bolt/context/complete/__init__.py -> build/bdist.macosx-14.0-arm64/wheel/./slack_bolt/context/complete562copying build/lib/slack_bolt/context/complete/complete.py -> build/bdist.macosx-14.0-arm64/wheel/./slack_bolt/context/complete563copying build/lib/slack_bolt/context/complete/async_complete.py -> build/bdist.macosx-14.0-arm64/wheel/./slack_bolt/context/complete564copying build/lib/slack_bolt/context/__init__.py -> build/bdist.macosx-14.0-arm64/wheel/./slack_bolt/context565creating build/bdist.macosx-14.0-arm64/wheel/slack_bolt/context/set_suggested_prompts566copying build/lib/slack_bolt/context/set_suggested_prompts/__init__.py -> build/bdist.macosx-14.0-arm64/wheel/./slack_bolt/context/set_suggested_prompts567copying build/lib/slack_bolt/context/set_suggested_prompts/set_suggested_prompts.py -> build/bdist.macosx-14.0-arm64/wheel/./slack_bolt/context/set_suggested_prompts568copying build/lib/slack_bolt/context/set_suggested_prompts/async_set_suggested_prompts.py -> build/bdist.macosx-14.0-arm64/wheel/./slack_bolt/context/set_suggested_prompts569copying build/lib/slack_bolt/context/async_context.py -> build/bdist.macosx-14.0-arm64/wheel/./slack_bolt/context570creating build/bdist.macosx-14.0-arm64/wheel/slack_bolt/context/say_stream571copying build/lib/slack_bolt/context/say_stream/async_say_stream.py -> build/bdist.macosx-14.0-arm64/wheel/./slack_bolt/context/say_stream572copying build/lib/slack_bolt/context/say_stream/__init__.py -> build/bdist.macosx-14.0-arm64/wheel/./slack_bolt/context/say_stream573copying build/lib/slack_bolt/context/say_stream/say_stream.py -> build/bdist.macosx-14.0-arm64/wheel/./slack_bolt/context/say_stream574creating build/bdist.macosx-14.0-arm64/wheel/slack_bolt/context/get_thread_context575copying build/lib/slack_bolt/context/get_thread_context/get_thread_context.py -> build/bdist.macosx-14.0-arm64/wheel/./slack_bolt/context/get_thread_context576copying build/lib/slack_bolt/context/get_thread_context/async_get_thread_context.py -> build/bdist.macosx-14.0-arm64/wheel/./slack_bolt/context/get_thread_context577copying build/lib/slack_bolt/context/get_thread_context/__init__.py -> build/bdist.macosx-14.0-arm64/wheel/./slack_bolt/context/get_thread_context578copying build/lib/slack_bolt/context/context.py -> build/bdist.macosx-14.0-arm64/wheel/./slack_bolt/context579creating build/bdist.macosx-14.0-arm64/wheel/slack_bolt/context/respond580copying build/lib/slack_bolt/context/respond/internals.py -> build/bdist.macosx-14.0-arm64/wheel/./slack_bolt/context/respond581copying build/lib/slack_bolt/context/respond/respond.py -> build/bdist.macosx-14.0-arm64/wheel/./slack_bolt/context/respond582copying build/lib/slack_bolt/context/respond/__init__.py -> build/bdist.macosx-14.0-arm64/wheel/./slack_bolt/context/respond583copying build/lib/slack_bolt/context/respond/async_respond.py -> build/bdist.macosx-14.0-arm64/wheel/./slack_bolt/context/respond584creating build/bdist.macosx-14.0-arm64/wheel/slack_bolt/context/set_title585copying build/lib/slack_bolt/context/set_title/async_set_title.py -> build/bdist.macosx-14.0-arm64/wheel/./slack_bolt/context/set_title586copying build/lib/slack_bolt/context/set_title/__init__.py -> build/bdist.macosx-14.0-arm64/wheel/./slack_bolt/context/set_title587copying build/lib/slack_bolt/context/set_title/set_title.py -> build/bdist.macosx-14.0-arm64/wheel/./slack_bolt/context/set_title588creating build/bdist.macosx-14.0-arm64/wheel/slack_bolt/context/ack589copying build/lib/slack_bolt/context/ack/internals.py -> build/bdist.macosx-14.0-arm64/wheel/./slack_bolt/context/ack590copying build/lib/slack_bolt/context/ack/async_ack.py -> build/bdist.macosx-14.0-arm64/wheel/./slack_bolt/context/ack591copying build/lib/slack_bolt/context/ack/ack.py -> build/bdist.macosx-14.0-arm64/wheel/./slack_bolt/context/ack592copying build/lib/slack_bolt/context/ack/__init__.py -> build/bdist.macosx-14.0-arm64/wheel/./slack_bolt/context/ack593creating build/bdist.macosx-14.0-arm64/wheel/slack_bolt/context/save_thread_context594copying build/lib/slack_bolt/context/save_thread_context/__init__.py -> build/bdist.macosx-14.0-arm64/wheel/./slack_bolt/context/save_thread_context595copying build/lib/slack_bolt/context/save_thread_context/save_thread_context.py -> build/bdist.macosx-14.0-arm64/wheel/./slack_bolt/context/save_thread_context596copying build/lib/slack_bolt/context/save_thread_context/async_save_thread_context.py -> build/bdist.macosx-14.0-arm64/wheel/./slack_bolt/context/save_thread_context597creating build/bdist.macosx-14.0-arm64/wheel/slack_bolt/oauth598copying build/lib/slack_bolt/oauth/internals.py -> build/bdist.macosx-14.0-arm64/wheel/./slack_bolt/oauth599copying build/lib/slack_bolt/oauth/async_oauth_flow.py -> build/bdist.macosx-14.0-arm64/wheel/./slack_bolt/oauth600copying build/lib/slack_bolt/oauth/__init__.py -> build/bdist.macosx-14.0-arm64/wheel/./slack_bolt/oauth601copying build/lib/slack_bolt/oauth/async_oauth_settings.py -> build/bdist.macosx-14.0-arm64/wheel/./slack_bolt/oauth602copying build/lib/slack_bolt/oauth/async_callback_options.py -> build/bdist.macosx-14.0-arm64/wheel/./slack_bolt/oauth603copying build/lib/slack_bolt/oauth/oauth_flow.py -> build/bdist.macosx-14.0-arm64/wheel/./slack_bolt/oauth604copying build/lib/slack_bolt/oauth/async_internals.py -> build/bdist.macosx-14.0-arm64/wheel/./slack_bolt/oauth605copying build/lib/slack_bolt/oauth/oauth_settings.py -> build/bdist.macosx-14.0-arm64/wheel/./slack_bolt/oauth606copying build/lib/slack_bolt/oauth/callback_options.py -> build/bdist.macosx-14.0-arm64/wheel/./slack_bolt/oauth607copying build/lib/slack_bolt/version.py -> build/bdist.macosx-14.0-arm64/wheel/./slack_bolt608creating build/bdist.macosx-14.0-arm64/wheel/slack_bolt/logger609copying build/lib/slack_bolt/logger/__init__.py -> build/bdist.macosx-14.0-arm64/wheel/./slack_bolt/logger610copying build/lib/slack_bolt/logger/messages.py -> build/bdist.macosx-14.0-arm64/wheel/./slack_bolt/logger611creating build/bdist.macosx-14.0-arm64/wheel/slack_bolt/app612copying build/lib/slack_bolt/app/__init__.py -> build/bdist.macosx-14.0-arm64/wheel/./slack_bolt/app613copying build/lib/slack_bolt/app/app.py -> build/bdist.macosx-14.0-arm64/wheel/./slack_bolt/app614copying build/lib/slack_bolt/app/async_server.py -> build/bdist.macosx-14.0-arm64/wheel/./slack_bolt/app615copying build/lib/slack_bolt/app/async_app.py -> build/bdist.macosx-14.0-arm64/wheel/./slack_bolt/app616creating build/bdist.macosx-14.0-arm64/wheel/slack_bolt/response617copying build/lib/slack_bolt/response/__init__.py -> build/bdist.macosx-14.0-arm64/wheel/./slack_bolt/response618copying build/lib/slack_bolt/response/response.py -> build/bdist.macosx-14.0-arm64/wheel/./slack_bolt/response619creating build/bdist.macosx-14.0-arm64/wheel/slack_bolt/util620copying build/lib/slack_bolt/util/async_utils.py -> build/bdist.macosx-14.0-arm64/wheel/./slack_bolt/util621copying build/lib/slack_bolt/util/__init__.py -> build/bdist.macosx-14.0-arm64/wheel/./slack_bolt/util622copying build/lib/slack_bolt/util/utils.py -> build/bdist.macosx-14.0-arm64/wheel/./slack_bolt/util623creating build/bdist.macosx-14.0-arm64/wheel/slack_bolt/workflows624creating build/bdist.macosx-14.0-arm64/wheel/slack_bolt/workflows/step625copying build/lib/slack_bolt/workflows/step/internals.py -> build/bdist.macosx-14.0-arm64/wheel/./slack_bolt/workflows/step626copying build/lib/slack_bolt/workflows/step/__init__.py -> build/bdist.macosx-14.0-arm64/wheel/./slack_bolt/workflows/step627creating build/bdist.macosx-14.0-arm64/wheel/slack_bolt/workflows/step/utilities628copying build/lib/slack_bolt/workflows/step/utilities/update.py -> build/bdist.macosx-14.0-arm64/wheel/./slack_bolt/workflows/step/utilities629copying build/lib/slack_bolt/workflows/step/utilities/configure.py -> build/bdist.macosx-14.0-arm64/wheel/./slack_bolt/workflows/step/utilities630copying build/lib/slack_bolt/workflows/step/utilities/__init__.py -> build/bdist.macosx-14.0-arm64/wheel/./slack_bolt/workflows/step/utilities631copying build/lib/slack_bolt/workflows/step/utilities/fail.py -> build/bdist.macosx-14.0-arm64/wheel/./slack_bolt/workflows/step/utilities632copying build/lib/slack_bolt/workflows/step/utilities/complete.py -> build/bdist.macosx-14.0-arm64/wheel/./slack_bolt/workflows/step/utilities633copying build/lib/slack_bolt/workflows/step/utilities/async_configure.py -> build/bdist.macosx-14.0-arm64/wheel/./slack_bolt/workflows/step/utilities634copying build/lib/slack_bolt/workflows/step/utilities/async_fail.py -> build/bdist.macosx-14.0-arm64/wheel/./slack_bolt/workflows/step/utilities635copying build/lib/slack_bolt/workflows/step/utilities/async_complete.py -> build/bdist.macosx-14.0-arm64/wheel/./slack_bolt/workflows/step/utilities636copying build/lib/slack_bolt/workflows/step/utilities/async_update.py -> build/bdist.macosx-14.0-arm64/wheel/./slack_bolt/workflows/step/utilities637copying build/lib/slack_bolt/workflows/step/step.py -> build/bdist.macosx-14.0-arm64/wheel/./slack_bolt/workflows/step638copying build/lib/slack_bolt/workflows/step/async_step_middleware.py -> build/bdist.macosx-14.0-arm64/wheel/./slack_bolt/workflows/step639copying build/lib/slack_bolt/workflows/step/step_middleware.py -> build/bdist.macosx-14.0-arm64/wheel/./slack_bolt/workflows/step640copying build/lib/slack_bolt/workflows/step/async_step.py -> build/bdist.macosx-14.0-arm64/wheel/./slack_bolt/workflows/step641copying build/lib/slack_bolt/workflows/__init__.py -> build/bdist.macosx-14.0-arm64/wheel/./slack_bolt/workflows642copying build/lib/slack_bolt/__init__.py -> build/bdist.macosx-14.0-arm64/wheel/./slack_bolt643creating build/bdist.macosx-14.0-arm64/wheel/slack_bolt/listener_matcher644copying build/lib/slack_bolt/listener_matcher/async_builtins.py -> build/bdist.macosx-14.0-arm64/wheel/./slack_bolt/listener_matcher645copying build/lib/slack_bolt/listener_matcher/builtins.py -> build/bdist.macosx-14.0-arm64/wheel/./slack_bolt/listener_matcher646copying build/lib/slack_bolt/listener_matcher/listener_matcher.py -> build/bdist.macosx-14.0-arm64/wheel/./slack_bolt/listener_matcher647copying build/lib/slack_bolt/listener_matcher/__init__.py -> build/bdist.macosx-14.0-arm64/wheel/./slack_bolt/listener_matcher648copying build/lib/slack_bolt/listener_matcher/async_listener_matcher.py -> build/bdist.macosx-14.0-arm64/wheel/./slack_bolt/listener_matcher649copying build/lib/slack_bolt/listener_matcher/custom_listener_matcher.py -> build/bdist.macosx-14.0-arm64/wheel/./slack_bolt/listener_matcher650creating build/bdist.macosx-14.0-arm64/wheel/slack_bolt/adapter651creating build/bdist.macosx-14.0-arm64/wheel/slack_bolt/adapter/flask652copying build/lib/slack_bolt/adapter/flask/handler.py -> build/bdist.macosx-14.0-arm64/wheel/./slack_bolt/adapter/flask653copying build/lib/slack_bolt/adapter/flask/__init__.py -> build/bdist.macosx-14.0-arm64/wheel/./slack_bolt/adapter/flask654creating build/bdist.macosx-14.0-arm64/wheel/slack_bolt/adapter/aiohttp655copying build/lib/slack_bolt/adapter/aiohttp/__init__.py -> build/bdist.macosx-14.0-arm64/wheel/./slack_bolt/adapter/aiohttp656creating build/bdist.macosx-14.0-arm64/wheel/slack_bolt/adapter/asgi657creating build/bdist.macosx-14.0-arm64/wheel/slack_bolt/adapter/asgi/aiohttp658copying build/lib/slack_bolt/adapter/asgi/aiohttp/__init__.py -> build/bdist.macosx-14.0-arm64/wheel/./slack_bolt/adapter/asgi/aiohttp659copying build/lib/slack_bolt/adapter/asgi/http_response.py -> build/bdist.macosx-14.0-arm64/wheel/./slack_bolt/adapter/asgi660copying build/lib/slack_bolt/adapter/asgi/__init__.py -> build/bdist.macosx-14.0-arm64/wheel/./slack_bolt/adapter/asgi661copying build/lib/slack_bolt/adapter/asgi/utils.py -> build/bdist.macosx-14.0-arm64/wheel/./slack_bolt/adapter/asgi662copying build/lib/slack_bolt/adapter/asgi/base_handler.py -> build/bdist.macosx-14.0-arm64/wheel/./slack_bolt/adapter/asgi663copying build/lib/slack_bolt/adapter/asgi/async_handler.py -> build/bdist.macosx-14.0-arm64/wheel/./slack_bolt/adapter/asgi664copying build/lib/slack_bolt/adapter/asgi/http_request.py -> build/bdist.macosx-14.0-arm64/wheel/./slack_bolt/adapter/asgi665creating build/bdist.macosx-14.0-arm64/wheel/slack_bolt/adapter/asgi/builtin666copying build/lib/slack_bolt/adapter/asgi/builtin/__init__.py -> build/bdist.macosx-14.0-arm64/wheel/./slack_bolt/adapter/asgi/builtin667creating build/bdist.macosx-14.0-arm64/wheel/slack_bolt/adapter/pyramid668copying build/lib/slack_bolt/adapter/pyramid/handler.py -> build/bdist.macosx-14.0-arm64/wheel/./slack_bolt/adapter/pyramid669copying build/lib/slack_bolt/adapter/pyramid/__init__.py -> build/bdist.macosx-14.0-arm64/wheel/./slack_bolt/adapter/pyramid670creating build/bdist.macosx-14.0-arm64/wheel/slack_bolt/adapter/starlette671copying build/lib/slack_bolt/adapter/starlette/handler.py -> build/bdist.macosx-14.0-arm64/wheel/./slack_bolt/adapter/starlette672copying build/lib/slack_bolt/adapter/starlette/__init__.py -> build/bdist.macosx-14.0-arm64/wheel/./slack_bolt/adapter/starlette673copying build/lib/slack_bolt/adapter/starlette/async_handler.py -> build/bdist.macosx-14.0-arm64/wheel/./slack_bolt/adapter/starlette674creating build/bdist.macosx-14.0-arm64/wheel/slack_bolt/adapter/wsgi675copying build/lib/slack_bolt/adapter/wsgi/internals.py -> build/bdist.macosx-14.0-arm64/wheel/./slack_bolt/adapter/wsgi676copying build/lib/slack_bolt/adapter/wsgi/handler.py -> build/bdist.macosx-14.0-arm64/wheel/./slack_bolt/adapter/wsgi677copying build/lib/slack_bolt/adapter/wsgi/http_response.py -> build/bdist.macosx-14.0-arm64/wheel/./slack_bolt/adapter/wsgi678copying build/lib/slack_bolt/adapter/wsgi/__init__.py -> build/bdist.macosx-14.0-arm64/wheel/./slack_bolt/adapter/wsgi679copying build/lib/slack_bolt/adapter/wsgi/http_request.py -> build/bdist.macosx-14.0-arm64/wheel/./slack_bolt/adapter/wsgi680creating build/bdist.macosx-14.0-arm64/wheel/slack_bolt/adapter/cherrypy681copying build/lib/slack_bolt/adapter/cherrypy/handler.py -> build/bdist.macosx-14.0-arm64/wheel/./slack_bolt/adapter/cherrypy682copying build/lib/slack_bolt/adapter/cherrypy/__init__.py -> build/bdist.macosx-14.0-arm64/wheel/./slack_bolt/adapter/cherrypy683creating build/bdist.macosx-14.0-arm64/wheel/slack_bolt/adapter/google_cloud_functions684copying build/lib/slack_bolt/adapter/google_cloud_functions/handler.py -> build/bdist.macosx-14.0-arm64/wheel/./slack_bolt/adapter/google_cloud_functions685copying build/lib/slack_bolt/adapter/google_cloud_functions/__init__.py -> build/bdist.macosx-14.0-arm64/wheel/./slack_bolt/adapter/google_cloud_functions686copying build/lib/slack_bolt/adapter/__init__.py -> build/bdist.macosx-14.0-arm64/wheel/./slack_bolt/adapter687creating build/bdist.macosx-14.0-arm64/wheel/slack_bolt/adapter/tornado688copying build/lib/slack_bolt/adapter/tornado/handler.py -> build/bdist.macosx-14.0-arm64/wheel/./slack_bolt/adapter/tornado689copying build/lib/slack_bolt/adapter/tornado/__init__.py -> build/bdist.macosx-14.0-arm64/wheel/./slack_bolt/adapter/tornado690copying build/lib/slack_bolt/adapter/tornado/async_handler.py -> build/bdist.macosx-14.0-arm64/wheel/./slack_bolt/adapter/tornado691creating build/bdist.macosx-14.0-arm64/wheel/slack_bolt/adapter/socket_mode692creating build/bdist.macosx-14.0-arm64/wheel/slack_bolt/adapter/socket_mode/aiohttp693copying build/lib/slack_bolt/adapter/socket_mode/aiohttp/__init__.py -> build/bdist.macosx-14.0-arm64/wheel/./slack_bolt/adapter/socket_mode/aiohttp694copying build/lib/slack_bolt/adapter/socket_mode/async_base_handler.py -> build/bdist.macosx-14.0-arm64/wheel/./slack_bolt/adapter/socket_mode695copying build/lib/slack_bolt/adapter/socket_mode/internals.py -> build/bdist.macosx-14.0-arm64/wheel/./slack_bolt/adapter/socket_mode696creating build/bdist.macosx-14.0-arm64/wheel/slack_bolt/adapter/socket_mode/websocket_client697copying build/lib/slack_bolt/adapter/socket_mode/websocket_client/__init__.py -> build/bdist.macosx-14.0-arm64/wheel/./slack_bolt/adapter/socket_mode/websocket_client698copying build/lib/slack_bolt/adapter/socket_mode/__init__.py -> build/bdist.macosx-14.0-arm64/wheel/./slack_bolt/adapter/socket_mode699creating build/bdist.macosx-14.0-arm64/wheel/slack_bolt/adapter/socket_mode/websockets700copying build/lib/slack_bolt/adapter/socket_mode/websockets/__init__.py -> build/bdist.macosx-14.0-arm64/wheel/./slack_bolt/adapter/socket_mode/websockets701copying build/lib/slack_bolt/adapter/socket_mode/base_handler.py -> build/bdist.macosx-14.0-arm64/wheel/./slack_bolt/adapter/socket_mode702copying build/lib/slack_bolt/adapter/socket_mode/async_internals.py -> build/bdist.macosx-14.0-arm64/wheel/./slack_bolt/adapter/socket_mode703copying build/lib/slack_bolt/adapter/socket_mode/async_handler.py -> build/bdist.macosx-14.0-arm64/wheel/./slack_bolt/adapter/socket_mode704creating build/bdist.macosx-14.0-arm64/wheel/slack_bolt/adapter/socket_mode/builtin705copying build/lib/slack_bolt/adapter/socket_mode/builtin/__init__.py -> build/bdist.macosx-14.0-arm64/wheel/./slack_bolt/adapter/socket_mode/builtin706creating build/bdist.macosx-14.0-arm64/wheel/slack_bolt/adapter/fastapi707copying build/lib/slack_bolt/adapter/fastapi/__init__.py -> build/bdist.macosx-14.0-arm64/wheel/./slack_bolt/adapter/fastapi708copying build/lib/slack_bolt/adapter/fastapi/async_handler.py -> build/bdist.macosx-14.0-arm64/wheel/./slack_bolt/adapter/fastapi709creating build/bdist.macosx-14.0-arm64/wheel/slack_bolt/adapter/sanic710copying build/lib/slack_bolt/adapter/sanic/__init__.py -> build/bdist.macosx-14.0-arm64/wheel/./slack_bolt/adapter/sanic711copying build/lib/slack_bolt/adapter/sanic/async_handler.py -> build/bdist.macosx-14.0-arm64/wheel/./slack_bolt/adapter/sanic712creating build/bdist.macosx-14.0-arm64/wheel/slack_bolt/adapter/aws_lambda713copying build/lib/slack_bolt/adapter/aws_lambda/chalice_handler.py -> build/bdist.macosx-14.0-arm64/wheel/./slack_bolt/adapter/aws_lambda714copying build/lib/slack_bolt/adapter/aws_lambda/lambda_s3_oauth_flow.py -> build/bdist.macosx-14.0-arm64/wheel/./slack_bolt/adapter/aws_lambda715copying build/lib/slack_bolt/adapter/aws_lambda/internals.py -> build/bdist.macosx-14.0-arm64/wheel/./slack_bolt/adapter/aws_lambda716copying build/lib/slack_bolt/adapter/aws_lambda/handler.py -> build/bdist.macosx-14.0-arm64/wheel/./slack_bolt/adapter/aws_lambda717copying build/lib/slack_bolt/adapter/aws_lambda/lazy_listener_runner.py -> build/bdist.macosx-14.0-arm64/wheel/./slack_bolt/adapter/aws_lambda718copying build/lib/slack_bolt/adapter/aws_lambda/local_lambda_client.py -> build/bdist.macosx-14.0-arm64/wheel/./slack_bolt/adapter/aws_lambda719copying build/lib/slack_bolt/adapter/aws_lambda/__init__.py -> build/bdist.macosx-14.0-arm64/wheel/./slack_bolt/adapter/aws_lambda720copying build/lib/slack_bolt/adapter/aws_lambda/chalice_lazy_listener_runner.py -> build/bdist.macosx-14.0-arm64/wheel/./slack_bolt/adapter/aws_lambda721creating build/bdist.macosx-14.0-arm64/wheel/slack_bolt/adapter/django722copying build/lib/slack_bolt/adapter/django/handler.py -> build/bdist.macosx-14.0-arm64/wheel/./slack_bolt/adapter/django723copying build/lib/slack_bolt/adapter/django/__init__.py -> build/bdist.macosx-14.0-arm64/wheel/./slack_bolt/adapter/django724creating build/bdist.macosx-14.0-arm64/wheel/slack_bolt/adapter/falcon725copying build/lib/slack_bolt/adapter/falcon/async_resource.py -> build/bdist.macosx-14.0-arm64/wheel/./slack_bolt/adapter/falcon726copying build/lib/slack_bolt/adapter/falcon/resource.py -> build/bdist.macosx-14.0-arm64/wheel/./slack_bolt/adapter/falcon727copying build/lib/slack_bolt/adapter/falcon/__init__.py -> build/bdist.macosx-14.0-arm64/wheel/./slack_bolt/adapter/falcon728creating build/bdist.macosx-14.0-arm64/wheel/slack_bolt/adapter/bottle729copying build/lib/slack_bolt/adapter/bottle/handler.py -> build/bdist.macosx-14.0-arm64/wheel/./slack_bolt/adapter/bottle730copying build/lib/slack_bolt/adapter/bottle/__init__.py -> build/bdist.macosx-14.0-arm64/wheel/./slack_bolt/adapter/bottle731creating build/bdist.macosx-14.0-arm64/wheel/slack_bolt/kwargs_injection732copying build/lib/slack_bolt/kwargs_injection/async_utils.py -> build/bdist.macosx-14.0-arm64/wheel/./slack_bolt/kwargs_injection733copying build/lib/slack_bolt/kwargs_injection/__init__.py -> build/bdist.macosx-14.0-arm64/wheel/./slack_bolt/kwargs_injection734copying build/lib/slack_bolt/kwargs_injection/utils.py -> build/bdist.macosx-14.0-arm64/wheel/./slack_bolt/kwargs_injection735copying build/lib/slack_bolt/kwargs_injection/args.py -> build/bdist.macosx-14.0-arm64/wheel/./slack_bolt/kwargs_injection736copying build/lib/slack_bolt/kwargs_injection/async_args.py -> build/bdist.macosx-14.0-arm64/wheel/./slack_bolt/kwargs_injection737copying build/lib/slack_bolt/py.typed -> build/bdist.macosx-14.0-arm64/wheel/./slack_bolt738creating build/bdist.macosx-14.0-arm64/wheel/slack_bolt/request739copying build/lib/slack_bolt/request/internals.py -> build/bdist.macosx-14.0-arm64/wheel/./slack_bolt/request740copying build/lib/slack_bolt/request/request.py -> build/bdist.macosx-14.0-arm64/wheel/./slack_bolt/request741copying build/lib/slack_bolt/request/payload_utils.py -> build/bdist.macosx-14.0-arm64/wheel/./slack_bolt/request742copying build/lib/slack_bolt/request/__init__.py -> build/bdist.macosx-14.0-arm64/wheel/./slack_bolt/request743copying build/lib/slack_bolt/request/async_request.py -> build/bdist.macosx-14.0-arm64/wheel/./slack_bolt/request744copying build/lib/slack_bolt/request/async_internals.py -> build/bdist.macosx-14.0-arm64/wheel/./slack_bolt/request745creating build/bdist.macosx-14.0-arm64/wheel/slack_bolt/authorization746copying build/lib/slack_bolt/authorization/authorize_result.py -> build/bdist.macosx-14.0-arm64/wheel/./slack_bolt/authorization747copying build/lib/slack_bolt/authorization/authorize.py -> build/bdist.macosx-14.0-arm64/wheel/./slack_bolt/authorization748copying build/lib/slack_bolt/authorization/authorize_args.py -> build/bdist.macosx-14.0-arm64/wheel/./slack_bolt/authorization749copying build/lib/slack_bolt/authorization/__init__.py -> build/bdist.macosx-14.0-arm64/wheel/./slack_bolt/authorization750copying build/lib/slack_bolt/authorization/async_authorize.py -> build/bdist.macosx-14.0-arm64/wheel/./slack_bolt/authorization751copying build/lib/slack_bolt/authorization/async_authorize_args.py -> build/bdist.macosx-14.0-arm64/wheel/./slack_bolt/authorization752creating build/bdist.macosx-14.0-arm64/wheel/slack_bolt/error753copying build/lib/slack_bolt/error/__init__.py -> build/bdist.macosx-14.0-arm64/wheel/./slack_bolt/error754copying build/lib/slack_bolt/async_app.py -> build/bdist.macosx-14.0-arm64/wheel/./slack_bolt755running install_egg_info756Copying slack_bolt.egg-info to build/bdist.macosx-14.0-arm64/wheel/./slack_bolt-1.30.0-py3.14.egg-info757running install_scripts758creating build/bdist.macosx-14.0-arm64/wheel/slack_bolt-1.30.0.dist-info/WHEEL759creating '/nix/var/nix/builds/nix-16169-4100965297/source/dist/.tmp-4cwh2din/slack_bolt-1.30.0-py2.py3-none-any.whl' and adding 'build/bdist.macosx-14.0-arm64/wheel' to it760adding 'slack_bolt/__init__.py'761adding 'slack_bolt/async_app.py'762adding 'slack_bolt/py.typed'763adding 'slack_bolt/version.py'764adding 'slack_bolt/adapter/__init__.py'765adding 'slack_bolt/adapter/aiohttp/__init__.py'766adding 'slack_bolt/adapter/asgi/__init__.py'767adding 'slack_bolt/adapter/asgi/async_handler.py'768adding 'slack_bolt/adapter/asgi/base_handler.py'769adding 'slack_bolt/adapter/asgi/http_request.py'770adding 'slack_bolt/adapter/asgi/http_response.py'771adding 'slack_bolt/adapter/asgi/utils.py'772adding 'slack_bolt/adapter/asgi/aiohttp/__init__.py'773adding 'slack_bolt/adapter/asgi/builtin/__init__.py'774adding 'slack_bolt/adapter/aws_lambda/__init__.py'775adding 'slack_bolt/adapter/aws_lambda/chalice_handler.py'776adding 'slack_bolt/adapter/aws_lambda/chalice_lazy_listener_runner.py'777adding 'slack_bolt/adapter/aws_lambda/handler.py'778adding 'slack_bolt/adapter/aws_lambda/internals.py'779adding 'slack_bolt/adapter/aws_lambda/lambda_s3_oauth_flow.py'780adding 'slack_bolt/adapter/aws_lambda/lazy_listener_runner.py'781adding 'slack_bolt/adapter/aws_lambda/local_lambda_client.py'782adding 'slack_bolt/adapter/bottle/__init__.py'783adding 'slack_bolt/adapter/bottle/handler.py'784adding 'slack_bolt/adapter/cherrypy/__init__.py'785adding 'slack_bolt/adapter/cherrypy/handler.py'786adding 'slack_bolt/adapter/django/__init__.py'787adding 'slack_bolt/adapter/django/handler.py'788adding 'slack_bolt/adapter/falcon/__init__.py'789adding 'slack_bolt/adapter/falcon/async_resource.py'790adding 'slack_bolt/adapter/falcon/resource.py'791adding 'slack_bolt/adapter/fastapi/__init__.py'792adding 'slack_bolt/adapter/fastapi/async_handler.py'793adding 'slack_bolt/adapter/flask/__init__.py'794adding 'slack_bolt/adapter/flask/handler.py'795adding 'slack_bolt/adapter/google_cloud_functions/__init__.py'796adding 'slack_bolt/adapter/google_cloud_functions/handler.py'797adding 'slack_bolt/adapter/pyramid/__init__.py'798adding 'slack_bolt/adapter/pyramid/handler.py'799adding 'slack_bolt/adapter/sanic/__init__.py'800adding 'slack_bolt/adapter/sanic/async_handler.py'801adding 'slack_bolt/adapter/socket_mode/__init__.py'802adding 'slack_bolt/adapter/socket_mode/async_base_handler.py'803adding 'slack_bolt/adapter/socket_mode/async_handler.py'804adding 'slack_bolt/adapter/socket_mode/async_internals.py'805adding 'slack_bolt/adapter/socket_mode/base_handler.py'806adding 'slack_bolt/adapter/socket_mode/internals.py'807adding 'slack_bolt/adapter/socket_mode/aiohttp/__init__.py'808adding 'slack_bolt/adapter/socket_mode/builtin/__init__.py'809adding 'slack_bolt/adapter/socket_mode/websocket_client/__init__.py'810adding 'slack_bolt/adapter/socket_mode/websockets/__init__.py'811adding 'slack_bolt/adapter/starlette/__init__.py'812adding 'slack_bolt/adapter/starlette/async_handler.py'813adding 'slack_bolt/adapter/starlette/handler.py'814adding 'slack_bolt/adapter/tornado/__init__.py'815adding 'slack_bolt/adapter/tornado/async_handler.py'816adding 'slack_bolt/adapter/tornado/handler.py'817adding 'slack_bolt/adapter/wsgi/__init__.py'818adding 'slack_bolt/adapter/wsgi/handler.py'819adding 'slack_bolt/adapter/wsgi/http_request.py'820adding 'slack_bolt/adapter/wsgi/http_response.py'821adding 'slack_bolt/adapter/wsgi/internals.py'822adding 'slack_bolt/app/__init__.py'823adding 'slack_bolt/app/app.py'824adding 'slack_bolt/app/async_app.py'825adding 'slack_bolt/app/async_server.py'826adding 'slack_bolt/authorization/__init__.py'827adding 'slack_bolt/authorization/async_authorize.py'828adding 'slack_bolt/authorization/async_authorize_args.py'829adding 'slack_bolt/authorization/authorize.py'830adding 'slack_bolt/authorization/authorize_args.py'831adding 'slack_bolt/authorization/authorize_result.py'832adding 'slack_bolt/context/__init__.py'833adding 'slack_bolt/context/async_context.py'834adding 'slack_bolt/context/base_context.py'835adding 'slack_bolt/context/context.py'836adding 'slack_bolt/context/ack/__init__.py'837adding 'slack_bolt/context/ack/ack.py'838adding 'slack_bolt/context/ack/async_ack.py'839adding 'slack_bolt/context/ack/internals.py'840adding 'slack_bolt/context/assistant/__init__.py'841adding 'slack_bolt/context/assistant/assistant_utilities.py'842adding 'slack_bolt/context/assistant/async_assistant_utilities.py'843adding 'slack_bolt/context/assistant/internals.py'844adding 'slack_bolt/context/assistant/thread_context/__init__.py'845adding 'slack_bolt/context/assistant/thread_context_store/__init__.py'846adding 'slack_bolt/context/assistant/thread_context_store/async_store.py'847adding 'slack_bolt/context/assistant/thread_context_store/default_async_store.py'848adding 'slack_bolt/context/assistant/thread_context_store/default_store.py'849adding 'slack_bolt/context/assistant/thread_context_store/store.py'850adding 'slack_bolt/context/assistant/thread_context_store/file/__init__.py'851adding 'slack_bolt/context/complete/__init__.py'852adding 'slack_bolt/context/complete/async_complete.py'853adding 'slack_bolt/context/complete/complete.py'854adding 'slack_bolt/context/fail/__init__.py'855adding 'slack_bolt/context/fail/async_fail.py'856adding 'slack_bolt/context/fail/fail.py'857adding 'slack_bolt/context/get_thread_context/__init__.py'858adding 'slack_bolt/context/get_thread_context/async_get_thread_context.py'859adding 'slack_bolt/context/get_thread_context/get_thread_context.py'860adding 'slack_bolt/context/respond/__init__.py'861adding 'slack_bolt/context/respond/async_respond.py'862adding 'slack_bolt/context/respond/internals.py'863adding 'slack_bolt/context/respond/respond.py'864adding 'slack_bolt/context/save_thread_context/__init__.py'865adding 'slack_bolt/context/save_thread_context/async_save_thread_context.py'866adding 'slack_bolt/context/save_thread_context/save_thread_context.py'867adding 'slack_bolt/context/say/__init__.py'868adding 'slack_bolt/context/say/async_say.py'869adding 'slack_bolt/context/say/internals.py'870adding 'slack_bolt/context/say/say.py'871adding 'slack_bolt/context/say_stream/__init__.py'872adding 'slack_bolt/context/say_stream/async_say_stream.py'873adding 'slack_bolt/context/say_stream/say_stream.py'874adding 'slack_bolt/context/set_status/__init__.py'875adding 'slack_bolt/context/set_status/async_set_status.py'876adding 'slack_bolt/context/set_status/set_status.py'877adding 'slack_bolt/context/set_suggested_prompts/__init__.py'878adding 'slack_bolt/context/set_suggested_prompts/async_set_suggested_prompts.py'879adding 'slack_bolt/context/set_suggested_prompts/set_suggested_prompts.py'880adding 'slack_bolt/context/set_title/__init__.py'881adding 'slack_bolt/context/set_title/async_set_title.py'882adding 'slack_bolt/context/set_title/set_title.py'883adding 'slack_bolt/error/__init__.py'884adding 'slack_bolt/kwargs_injection/__init__.py'885adding 'slack_bolt/kwargs_injection/args.py'886adding 'slack_bolt/kwargs_injection/async_args.py'887adding 'slack_bolt/kwargs_injection/async_utils.py'888adding 'slack_bolt/kwargs_injection/utils.py'889adding 'slack_bolt/lazy_listener/__init__.py'890adding 'slack_bolt/lazy_listener/async_internals.py'891adding 'slack_bolt/lazy_listener/async_runner.py'892adding 'slack_bolt/lazy_listener/asyncio_runner.py'893adding 'slack_bolt/lazy_listener/internals.py'894adding 'slack_bolt/lazy_listener/runner.py'895adding 'slack_bolt/lazy_listener/thread_runner.py'896adding 'slack_bolt/listener/__init__.py'897adding 'slack_bolt/listener/async_builtins.py'898adding 'slack_bolt/listener/async_listener.py'899adding 'slack_bolt/listener/async_listener_completion_handler.py'900adding 'slack_bolt/listener/async_listener_error_handler.py'901adding 'slack_bolt/listener/async_listener_start_handler.py'902adding 'slack_bolt/listener/asyncio_runner.py'903adding 'slack_bolt/listener/builtins.py'904adding 'slack_bolt/listener/custom_listener.py'905adding 'slack_bolt/listener/listener.py'906adding 'slack_bolt/listener/listener_completion_handler.py'907adding 'slack_bolt/listener/listener_error_handler.py'908adding 'slack_bolt/listener/listener_start_handler.py'909adding 'slack_bolt/listener/thread_runner.py'910adding 'slack_bolt/listener_matcher/__init__.py'911adding 'slack_bolt/listener_matcher/async_builtins.py'912adding 'slack_bolt/listener_matcher/async_listener_matcher.py'913adding 'slack_bolt/listener_matcher/builtins.py'914adding 'slack_bolt/listener_matcher/custom_listener_matcher.py'915adding 'slack_bolt/listener_matcher/listener_matcher.py'916adding 'slack_bolt/logger/__init__.py'917adding 'slack_bolt/logger/messages.py'918adding 'slack_bolt/middleware/__init__.py'919adding 'slack_bolt/middleware/async_builtins.py'920adding 'slack_bolt/middleware/async_custom_middleware.py'921adding 'slack_bolt/middleware/async_middleware.py'922adding 'slack_bolt/middleware/async_middleware_error_handler.py'923adding 'slack_bolt/middleware/custom_middleware.py'924adding 'slack_bolt/middleware/middleware.py'925adding 'slack_bolt/middleware/middleware_error_handler.py'926adding 'slack_bolt/middleware/assistant/__init__.py'927adding 'slack_bolt/middleware/assistant/assistant.py'928adding 'slack_bolt/middleware/assistant/async_assistant.py'929adding 'slack_bolt/middleware/attaching_conversation_kwargs/__init__.py'930adding 'slack_bolt/middleware/attaching_conversation_kwargs/async_attaching_conversation_kwargs.py'931adding 'slack_bolt/middleware/attaching_conversation_kwargs/attaching_conversation_kwargs.py'932adding 'slack_bolt/middleware/attaching_function_token/__init__.py'933adding 'slack_bolt/middleware/attaching_function_token/async_attaching_function_token.py'934adding 'slack_bolt/middleware/attaching_function_token/attaching_function_token.py'935adding 'slack_bolt/middleware/authorization/__init__.py'936adding 'slack_bolt/middleware/authorization/async_authorization.py'937adding 'slack_bolt/middleware/authorization/async_internals.py'938adding 'slack_bolt/middleware/authorization/async_multi_teams_authorization.py'939adding 'slack_bolt/middleware/authorization/async_single_team_authorization.py'940adding 'slack_bolt/middleware/authorization/authorization.py'941adding 'slack_bolt/middleware/authorization/internals.py'942adding 'slack_bolt/middleware/authorization/multi_teams_authorization.py'943adding 'slack_bolt/middleware/authorization/single_team_authorization.py'944adding 'slack_bolt/middleware/ignoring_self_events/__init__.py'945adding 'slack_bolt/middleware/ignoring_self_events/async_ignoring_self_events.py'946adding 'slack_bolt/middleware/ignoring_self_events/ignoring_self_events.py'947adding 'slack_bolt/middleware/message_listener_matches/__init__.py'948adding 'slack_bolt/middleware/message_listener_matches/async_message_listener_matches.py'949adding 'slack_bolt/middleware/message_listener_matches/message_listener_matches.py'950adding 'slack_bolt/middleware/request_verification/__init__.py'951adding 'slack_bolt/middleware/request_verification/async_request_verification.py'952adding 'slack_bolt/middleware/request_verification/request_verification.py'953adding 'slack_bolt/middleware/ssl_check/__init__.py'954adding 'slack_bolt/middleware/ssl_check/async_ssl_check.py'955adding 'slack_bolt/middleware/ssl_check/ssl_check.py'956adding 'slack_bolt/middleware/url_verification/__init__.py'957adding 'slack_bolt/middleware/url_verification/async_url_verification.py'958adding 'slack_bolt/middleware/url_verification/url_verification.py'959adding 'slack_bolt/oauth/__init__.py'960adding 'slack_bolt/oauth/async_callback_options.py'961adding 'slack_bolt/oauth/async_internals.py'962adding 'slack_bolt/oauth/async_oauth_flow.py'963adding 'slack_bolt/oauth/async_oauth_settings.py'964adding 'slack_bolt/oauth/callback_options.py'965adding 'slack_bolt/oauth/internals.py'966adding 'slack_bolt/oauth/oauth_flow.py'967adding 'slack_bolt/oauth/oauth_settings.py'968adding 'slack_bolt/request/__init__.py'969adding 'slack_bolt/request/async_internals.py'970adding 'slack_bolt/request/async_request.py'971adding 'slack_bolt/request/internals.py'972adding 'slack_bolt/request/payload_utils.py'973adding 'slack_bolt/request/request.py'974adding 'slack_bolt/response/__init__.py'975adding 'slack_bolt/response/response.py'976adding 'slack_bolt/util/__init__.py'977adding 'slack_bolt/util/async_utils.py'978adding 'slack_bolt/util/utils.py'979adding 'slack_bolt/workflows/__init__.py'980adding 'slack_bolt/workflows/step/__init__.py'981adding 'slack_bolt/workflows/step/async_step.py'982adding 'slack_bolt/workflows/step/async_step_middleware.py'983adding 'slack_bolt/workflows/step/internals.py'984adding 'slack_bolt/workflows/step/step.py'985adding 'slack_bolt/workflows/step/step_middleware.py'986adding 'slack_bolt/workflows/step/utilities/__init__.py'987adding 'slack_bolt/workflows/step/utilities/async_complete.py'988adding 'slack_bolt/workflows/step/utilities/async_configure.py'989adding 'slack_bolt/workflows/step/utilities/async_fail.py'990adding 'slack_bolt/workflows/step/utilities/async_update.py'991adding 'slack_bolt/workflows/step/utilities/complete.py'992adding 'slack_bolt/workflows/step/utilities/configure.py'993adding 'slack_bolt/workflows/step/utilities/fail.py'994adding 'slack_bolt/workflows/step/utilities/update.py'995adding 'slack_bolt-1.30.0.dist-info/licenses/LICENSE'996adding 'slack_bolt-1.30.0.dist-info/METADATA'997adding 'slack_bolt-1.30.0.dist-info/WHEEL'998adding 'slack_bolt-1.30.0.dist-info/top_level.txt'999adding 'slack_bolt-1.30.0.dist-info/RECORD'1000removing build/bdist.macosx-14.0-arm64/wheel1001Successfully built slack_bolt-1.30.0-py2.py3-none-any.whl1002Finished creating a wheel...1003Finished executing pypaBuildPhasepythonRuntimeDepsCheckHook
1004Executing pythonRuntimeDepsCheck1005Checking runtime dependencies for slack_bolt-1.30.0-py2.py3-none-any.whl1006Finished executing pythonRuntimeDepsCheckinstallPhase
1007Executing pypaInstallPhase1008Successfully installed slack_bolt-1.30.0-py2.py3-none-any.whl1009Finished executing pypaInstallPhasepythonOutputDistPhase
1010Executing pythonOutputDistPhase1011Finished executing pythonOutputDistPhasefixupPhase
1012checking for references to /nix/var/nix/builds/nix-16169-4100965297/ in /nix/store/cqlha7v4j3b8i24sq6jxak9pvzvy4rb6-python3.14-slack-bolt-1.30.0...1013patching script interpreter paths in /nix/store/cqlha7v4j3b8i24sq6jxak9pvzvy4rb6-python3.14-slack-bolt-1.30.01014stripping (with command strip and flags -S) in /nix/store/cqlha7v4j3b8i24sq6jxak9pvzvy4rb6-python3.14-slack-bolt-1.30.0/lib1015checking for references to /nix/var/nix/builds/nix-16169-4100965297/ in /nix/store/9ihz9npyhvgc895s3vjcfjqjghhd4w1g-python3.14-slack-bolt-1.30.0-dist...1016patching script interpreter paths in /nix/store/9ihz9npyhvgc895s3vjcfjqjghhd4w1g-python3.14-slack-bolt-1.30.0-dist1017Executing pythonRemoveTestsDir1018Finished executing pythonRemoveTestsDirinstallCheckPhase
1019no Makefile or custom installCheckPhase, doing nothingpythonImportsCheckPhase
1020Executing pythonImportsCheckPhase1021Check whether the following modules can be imported: slack_boltpythonMetadataCheckPhase
1022Executing pythonMetadataCheckPhasepytestCheckPhase
1023Executing pytestCheckPhase1024pytest flags: -m pytest --ignore-glob=tests/adapter_tests/bottle/ --ignore-glob=tests/adapter_tests/pyramid/ --ignore-glob=tests/scenario_tests_async/test_events_assistant.py -k not\ \(test_failure\)\ and\ not\ \(test_oauth\)\ and\ not\ \(test_buffer_size_overrides\)\ and\ not\ \(test_buffer_size_overrides\)\ and\ not\ \(test_default_params\)\ and\ not\ \(test_default_params\)\ and\ not\ \(test_parameter_overrides\)\ and\ not\ \(test_parameter_overrides\)1025============================= test session starts ==============================1026platform darwin -- Python 3.14.7, pytest-9.1.1, pluggy-1.6.01027rootdir: /nix/var/nix/builds/nix-16169-4100965297/source1028configfile: pyproject.toml1029testpaths: tests1030plugins: asyncio-1.4.0, typeguard-4.5.2, anyio-4.14.21031asyncio: mode=Mode.AUTO, debug=False, asyncio_default_fixture_loop_scope=None, asyncio_default_test_loop_scope=function1032collected 932 items / 77 deselected / 855 selected 10331034tests/adapter_tests/asgi/test_asgi_http.py ....... [ 0%]1035tests/adapter_tests/asgi/test_asgi_lifespan.py .... [ 1%]1036tests/adapter_tests/aws/test_aws_chalice.py ....... [ 2%]1037tests/adapter_tests/aws/test_aws_lambda.py ....... [ 2%]1038tests/adapter_tests/aws/test_lambda_s3_oauth_flow.py . [ 3%]1039tests/adapter_tests/cherrypy/test_cherrypy.py .... [ 3%]1040tests/adapter_tests/cherrypy/test_cherrypy_oauth.py . [ 3%]1041tests/adapter_tests/django/test_django.py ..... [ 4%]1042tests/adapter_tests/falcon/test_falcon.py .... [ 4%]1043tests/adapter_tests/flask/test_flask.py .... [ 5%]1044tests/adapter_tests/google_cloud_functions/test_google_cloud_functions.py . [ 5%]1045... [ 5%]1046tests/adapter_tests/socket_mode/test_interactions_builtin.py . [ 5%]1047tests/adapter_tests/socket_mode/test_interactions_websocket_client.py . [ 5%]1048tests/adapter_tests/socket_mode/test_internals.py .. [ 6%]1049tests/adapter_tests/socket_mode/test_lazy_listeners.py . [ 6%]1050tests/adapter_tests/starlette/test_fastapi.py .... [ 6%]1051tests/adapter_tests/starlette/test_starlette.py ... [ 7%]1052tests/adapter_tests/tornado/test_tornado.py ... [ 7%]1053tests/adapter_tests/wsgi/test_wsgi_http.py ...... [ 8%]1054tests/adapter_tests_async/socket_mode/test_async_aiohttp.py . [ 8%]1055tests/adapter_tests_async/socket_mode/test_async_lazy_listeners.py . [ 8%]1056tests/adapter_tests_async/socket_mode/test_async_websockets.py . [ 8%]1057tests/adapter_tests_async/test_async_asgi.py .... [ 8%]1058tests/adapter_tests_async/test_async_falcon.py .... [ 9%]1059tests/adapter_tests_async/test_async_fastapi.py .... [ 9%]1060tests/adapter_tests_async/test_async_sanic.py ... [ 10%]1061tests/adapter_tests_async/test_async_starlette.py ... [ 10%]1062tests/adapter_tests_async/test_tornado.py ... [ 10%]1063tests/scenario_tests/test_app.py ................ [ 12%]1064tests/scenario_tests/test_app_actor_user_token.py .. [ 12%]1065tests/scenario_tests/test_app_bot_only.py ....... [ 13%]1066tests/scenario_tests/test_app_custom_authorize.py ... [ 14%]1067tests/scenario_tests/test_app_decorators.py . [ 14%]1068tests/scenario_tests/test_app_installation_store.py . [ 14%]1069tests/scenario_tests/test_app_using_methods_in_class.py ........ [ 15%]1070tests/scenario_tests/test_attachment_actions.py ..... [ 15%]1071tests/scenario_tests/test_authorize.py .... [ 16%]1072tests/scenario_tests/test_block_actions.py ........ [ 17%]1073tests/scenario_tests/test_block_actions_respond.py .. [ 17%]1074tests/scenario_tests/test_block_suggestion.py ........ [ 18%]1075tests/scenario_tests/test_dialogs.py ............... [ 20%]1076tests/scenario_tests/test_error_handler.py ......... [ 21%]1077tests/scenario_tests/test_events.py ................ [ 23%]1078tests/scenario_tests/test_events_assistant.py ......... [ 24%]1079tests/scenario_tests/test_events_assistant_without_middleware.py ....... [ 25%]1080. [ 25%]1081tests/scenario_tests/test_events_ignore_self.py .... [ 25%]1082tests/scenario_tests/test_events_org_apps.py .... [ 26%]1083tests/scenario_tests/test_events_request_verification.py .. [ 26%]1084tests/scenario_tests/test_events_say_stream.py ........ [ 27%]1085tests/scenario_tests/test_events_set_status.py ....... [ 28%]1086tests/scenario_tests/test_events_shared_channels.py ......... [ 29%]1087tests/scenario_tests/test_events_socket_mode.py .......... [ 30%]1088tests/scenario_tests/test_events_token_revocations.py ... [ 30%]1089tests/scenario_tests/test_events_url_verification.py .. [ 30%]1090tests/scenario_tests/test_function.py ......... [ 31%]1091tests/scenario_tests/test_installation_store_authorize.py . [ 32%]1092tests/scenario_tests/test_lazy.py ... [ 32%]1093tests/scenario_tests/test_listener_middleware.py ... [ 32%]1094tests/scenario_tests/test_message.py ........... [ 34%]1095tests/scenario_tests/test_message_bot.py . [ 34%]1096tests/scenario_tests/test_message_changed.py . [ 34%]1097tests/scenario_tests/test_message_deleted.py . [ 34%]1098tests/scenario_tests/test_message_file_share.py . [ 34%]1099tests/scenario_tests/test_message_thread_broadcast.py . [ 34%]1100tests/scenario_tests/test_middleware.py ........ [ 35%]1101tests/scenario_tests/test_shortcut.py ....... [ 36%]1102tests/scenario_tests/test_slash_command.py .... [ 36%]1103tests/scenario_tests/test_ssl_check.py ... [ 37%]1104tests/scenario_tests/test_view_closed.py .... [ 37%]1105tests/scenario_tests/test_view_submission.py ...... [ 38%]1106tests/scenario_tests/test_web_client_customization.py ...... [ 39%]1107tests/scenario_tests/test_workflow_steps.py ....... [ 39%]1108tests/scenario_tests/test_workflow_steps_decorator_simple.py ... [ 40%]1109tests/scenario_tests/test_workflow_steps_decorator_with_args.py .... [ 40%]1110tests/scenario_tests_async/test_app.py ............. [ 42%]1111tests/scenario_tests_async/test_app_actor_user_token.py .. [ 42%]1112tests/scenario_tests_async/test_app_bot_only.py ...... [ 43%]1113tests/scenario_tests_async/test_app_custom_authorize.py ... [ 43%]1114tests/scenario_tests_async/test_app_decorators.py . [ 43%]1115tests/scenario_tests_async/test_app_dispatch.py .. [ 43%]1116tests/scenario_tests_async/test_app_installation_store.py . [ 43%]1117tests/scenario_tests_async/test_app_using_methods_in_class.py ......... [ 45%]1118tests/scenario_tests_async/test_attachment_actions.py ...... [ 45%]1119tests/scenario_tests_async/test_authorize.py .... [ 46%]1120tests/scenario_tests_async/test_block_actions.py ......... [ 47%]1121tests/scenario_tests_async/test_block_actions_respond.py . [ 47%]1122tests/scenario_tests_async/test_block_suggestion.py ........ [ 48%]1123tests/scenario_tests_async/test_dialogs.py ............... [ 50%]1124tests/scenario_tests_async/test_error_handler.py ......... [ 51%]1125tests/scenario_tests_async/test_events.py .................. [ 53%]1126tests/scenario_tests_async/test_events_assistant_without_middleware.py . [ 53%]1127.FF.... [ 54%]1128tests/scenario_tests_async/test_events_ignore_self.py .... [ 54%]1129tests/scenario_tests_async/test_events_org_apps.py .... [ 55%]1130tests/scenario_tests_async/test_events_request_verification.py .. [ 55%]1131tests/scenario_tests_async/test_events_say_stream.py ........ [ 56%]1132tests/scenario_tests_async/test_events_set_status.py ....... [ 57%]1133tests/scenario_tests_async/test_events_shared_channels.py ........... [ 58%]1134tests/scenario_tests_async/test_events_socket_mode.py ........... [ 59%]1135tests/scenario_tests_async/test_events_token_revocations.py ... [ 60%]1136tests/scenario_tests_async/test_events_url_verification.py .. [ 60%]1137tests/scenario_tests_async/test_function.py ......... [ 61%]1138tests/scenario_tests_async/test_installation_store_authorize.py . [ 61%]1139tests/scenario_tests_async/test_lazy.py .. [ 61%]1140tests/scenario_tests_async/test_listener_middleware.py .. [ 61%]1141tests/scenario_tests_async/test_message.py ........... [ 63%]1142tests/scenario_tests_async/test_message_bot.py . [ 63%]1143tests/scenario_tests_async/test_message_changed.py . [ 63%]1144tests/scenario_tests_async/test_message_deleted.py . [ 63%]1145tests/scenario_tests_async/test_message_file_share.py . [ 63%]1146tests/scenario_tests_async/test_message_thread_broadcast.py . [ 63%]1147tests/scenario_tests_async/test_middleware.py ...... [ 64%]1148tests/scenario_tests_async/test_shortcut.py ....... [ 65%]1149tests/scenario_tests_async/test_slash_command.py .... [ 65%]1150tests/scenario_tests_async/test_ssl_check.py .. [ 65%]1151tests/scenario_tests_async/test_view_closed.py .... [ 66%]1152tests/scenario_tests_async/test_view_submission.py ...... [ 67%]1153tests/scenario_tests_async/test_web_client_customization.py ...... [ 67%]1154tests/scenario_tests_async/test_workflow_steps.py ....127.0.0.1 - - [16/Oct/2026 21:22:32] "POST /workflows.stepFailed HTTP/1.1" 200 -1155... [ 68%]1156tests/scenario_tests_async/test_workflow_steps_decorator_simple.py ... [ 69%]1157tests/scenario_tests_async/test_workflow_steps_decorator_with_args.py .. [ 69%]1158.. [ 69%]1159tests/slack_bolt/app/test_dev_server.py . [ 69%]1160tests/slack_bolt/authorization/test_authorize.py ........... [ 70%]1161tests/slack_bolt/context/test_ack.py ........... [ 72%]1162tests/slack_bolt/context/test_complete.py .... [ 72%]1163tests/slack_bolt/context/test_fail.py .... [ 73%]1164tests/slack_bolt/context/test_respond.py .... [ 73%]1165tests/slack_bolt/context/test_respond_internals.py .......... [ 74%]1166tests/slack_bolt/context/test_say.py ........ [ 75%]1167tests/slack_bolt/context/test_say_stream.py ... [ 76%]1168tests/slack_bolt/context/test_set_status.py .... [ 76%]1169tests/slack_bolt/context/test_set_suggested_prompts.py ...... [ 77%]1170tests/slack_bolt/error/test_errors.py . [ 77%]1171tests/slack_bolt/kwargs_injection/test_args.py .. [ 77%]1172tests/slack_bolt/listener/test_listener_completion_handler.py . [ 77%]1173tests/slack_bolt/listener/test_listener_start_handler.py . [ 77%]1174tests/slack_bolt/listener_matcher/test_builtins.py ..... [ 78%]1175tests/slack_bolt/listener_matcher/test_custom_listener_matcher.py . [ 78%]1176tests/slack_bolt/logger/test_unmatched_suggestions.py ........... [ 79%]1177tests/slack_bolt/middleware/attaching_conversation_kwargs/test_attaching_conversation_kwargs.py . [ 79%]1178........ [ 80%]1179tests/slack_bolt/middleware/authorization/test_single_team_authorization.py . [ 80%]1180. [ 81%]1181tests/slack_bolt/middleware/request_verification/test_request_verification.py . [ 81%]1182..... [ 81%]1183tests/slack_bolt/oauth/test_internals.py ....... [ 82%]1184tests/slack_bolt/request/test_internals.py ................ [ 84%]1185tests/slack_bolt/request/test_payload_utils.py ............ [ 85%]1186tests/slack_bolt/request/test_request.py ..... [ 86%]1187tests/slack_bolt/util/test_util.py .... [ 86%]1188tests/slack_bolt/workflows/step/test_step.py .. [ 87%]1189tests/slack_bolt_async/app/test_server.py . [ 87%]1190tests/slack_bolt_async/authorization/test_async_authorize.py ........... [ 88%]1191 [ 88%]1192tests/slack_bolt_async/context/test_async_ack.py ........... [ 89%]1193tests/slack_bolt_async/context/test_async_complete.py .... [ 90%]1194tests/slack_bolt_async/context/test_async_fail.py .... [ 90%]1195tests/slack_bolt_async/context/test_async_respond.py .... [ 91%]1196tests/slack_bolt_async/context/test_async_say.py ........ [ 92%]1197tests/slack_bolt_async/context/test_async_say_stream.py ... [ 92%]1198tests/slack_bolt_async/context/test_async_set_status.py .... [ 92%]1199tests/slack_bolt_async/context/test_async_set_suggested_prompts.py ..... [ 93%]1200. [ 93%]1201tests/slack_bolt_async/kwargs_injection/test_async_args.py .. [ 93%]1202tests/slack_bolt_async/listener/test_async_listener_completion_handler.py . [ 94%]1203 [ 94%]1204tests/slack_bolt_async/listener/test_async_listener_start_handler.py . [ 94%]1205tests/slack_bolt_async/listener_matcher/test_async_custom_listener_matcher.py . [ 94%]1206 [ 94%]1207tests/slack_bolt_async/logger/test_unmatched_suggestions.py ........... [ 95%]1208tests/slack_bolt_async/middleware/attaching_conversation_kwargs/test_async_attaching_conversation_kwargs.py . [ 95%]1209........ [ 96%]1210tests/slack_bolt_async/middleware/authorization/test_single_team_authorization.py . [ 96%]1211. [ 96%]1212tests/slack_bolt_async/middleware/request_verification/test_request_verification.py . [ 96%]1213..... [ 97%]1214tests/slack_bolt_async/oauth/test_async_oauth_flow.py ............ [ 98%]1215tests/slack_bolt_async/oauth/test_async_oauth_flow_sqlite3.py ..... [ 99%]1216tests/slack_bolt_async/request/test_async_request.py .. [ 99%]1217tests/slack_bolt_async/workflows/step/test_async_step.py .. [100%]12181219=================================== FAILURES ===================================1220_________ TestAsyncEventsAssistantWithoutMiddleware.test_user_message __________12211222fut = <coroutine object Event.wait at 0x111570ac0>, timeout = 0.112231224 async def wait_for(fut, timeout):1225 """Wait for the single Future or coroutine to complete, with timeout.1226 1227 Coroutine will be wrapped in Task.1228 1229 Returns result of the Future or coroutine. When a timeout occurs,1230 it cancels the task and raises TimeoutError. To avoid the task1231 cancellation, wrap it in shield().1232 1233 If the wait is cancelled, the task is also cancelled.1234 1235 If the task suppresses the cancellation and returns a value instead,1236 that value is returned.1237 1238 This function is a coroutine.1239 """1240 # The special case for timeout <= 0 is for the following case:1241 #1242 # async def test_waitfor():1243 # func_started = False1244 #1245 # async def func():1246 # nonlocal func_started1247 # func_started = True1248 #1249 # try:1250 # await asyncio.wait_for(func(), 0)1251 # except asyncio.TimeoutError:1252 # assert not func_started1253 # else:1254 # assert False1255 #1256 # asyncio.run(test_waitfor())1257 1258 1259 if timeout is not None and timeout <= 0:1260 fut = ensure_future(fut)1261 1262 if fut.done():1263 return fut.result()1264 1265 await _cancel_and_wait(fut)1266 try:1267 return fut.result()1268 except exceptions.CancelledError as exc:1269 raise TimeoutError from exc1270 1271 async with timeouts.timeout(timeout):1272> return await fut1273 ^^^^^^^^^12741275/nix/store/0kcws5blwbdyxqxjd1w8hjipz61xny3k-python3-3.14.7/lib/python3.14/asyncio/tasks.py:488: 1276_ _ _ _ _ _ _ _ _ _ _ _ _ _ _ _ _ _ _ _ _ _ _ _ _ _ _ _ _ _ _ _ _ _ _ _ _ _ _ _ 12771278self = <asyncio.locks.Event object at 0x111a6c770 [unset]>12791280 async def wait(self):1281 """Block until the internal flag is true.1282 1283 If the internal flag is true on entry, return True1284 immediately. Otherwise, block until another task calls1285 set() to set the flag to true, then return True.1286 """1287 if self._value:1288 return True1289 1290 fut = self._get_loop().create_future()1291 self._waiters.append(fut)1292 try:1293> await fut1294E asyncio.exceptions.CancelledError12951296/nix/store/0kcws5blwbdyxqxjd1w8hjipz61xny3k-python3-3.14.7/lib/python3.14/asyncio/locks.py:213: CancelledError12971298The above exception was the direct cause of the following exception:12991300self = <tests.scenario_tests_async.test_events_assistant_without_middleware.TestAsyncEventsAssistantWithoutMiddleware object at 0x1109a1cd0>13011302 @pytest.mark.asyncio1303 async def test_user_message(self):1304 app = AsyncApp(client=self.web_client)1305 listener_called = asyncio.Event()1306 1307 @app.message("")1308 async def handle_message(1309 say: AsyncSay,1310 set_status: AsyncSetStatus,1311 set_title: AsyncSetTitle,1312 set_suggested_prompts: AsyncSetSuggestedPrompts,1313 get_thread_context: AsyncGetThreadContext,1314 save_thread_context: AsyncSaveThreadContext,1315 context: AsyncBoltContext,1316 ):1317 assert context.channel_id == "D111"1318 assert context.thread_ts == "1726133698.626339"1319 assert say.thread_ts == context.thread_ts1320 assert set_status is not None1321 assert set_title is not None1322 assert set_suggested_prompts is not None1323 assert get_thread_context is not None1324 assert save_thread_context is not None1325 try:1326 await set_status("is typing...")1327 await say("Here you are!")1328 listener_called.set()1329 except Exception as e:1330 await say(f"Oops, something went wrong (error: {e})")1331 1332 request = AsyncBoltRequest(body=user_message_event_body, mode="socket_mode")1333 response = await app.async_dispatch(request)1334 assert response.status == 2001335> assert (await asyncio.wait_for(listener_called.wait(), timeout=0.1)) is True1336 ^^^^^^^^^^^^^^^^^^^^^^^^^^^^^^^^^^^^^^^^^^^^^^^^^^^^^^^^^^^13371338tests/scenario_tests_async/test_events_assistant_without_middleware.py:146: 1339_ _ _ _ _ _ _ _ _ _ _ _ _ _ _ _ _ _ _ _ _ _ _ _ _ _ _ _ _ _ _ _ _ _ _ _ _ _ _ _ 1340/nix/store/0kcws5blwbdyxqxjd1w8hjipz61xny3k-python3-3.14.7/lib/python3.14/asyncio/tasks.py:487: in wait_for1341 async with timeouts.timeout(timeout):1342 ^^^^^^^^^^^^^^^^^^^^^^^^^1343_ _ _ _ _ _ _ _ _ _ _ _ _ _ _ _ _ _ _ _ _ _ _ _ _ _ _ _ _ _ _ _ _ _ _ _ _ _ _ _ 13441345self = <Timeout [expired]>1346exc_type = <class 'asyncio.exceptions.CancelledError'>1347exc_val = CancelledError(), exc_tb = <traceback object at 0x111a46200>13481349 async def __aexit__(1350 self,1351 exc_type: type[BaseException] | None,1352 exc_val: BaseException | None,1353 exc_tb: TracebackType | None,1354 ) -> bool | None:1355 assert self._state in (_State.ENTERED, _State.EXPIRING)1356 1357 if self._timeout_handler is not None:1358 self._timeout_handler.cancel()1359 self._timeout_handler = None1360 1361 if self._state is _State.EXPIRING:1362 self._state = _State.EXPIRED1363 1364 if self._task.uncancel() <= self._cancelling and exc_type is not None:1365 # Since there are no new cancel requests, we're1366 # handling this.1367 if issubclass(exc_type, exceptions.CancelledError):1368> raise TimeoutError from exc_val1369E TimeoutError13701371/nix/store/0kcws5blwbdyxqxjd1w8hjipz61xny3k-python3-3.14.7/lib/python3.14/asyncio/timeouts.py:115: TimeoutError1372------------------------------ Captured log setup ------------------------------13732026-10-16 21:21:57 DEBUG Using selector: KqueueSelector1374----------------------------- Captured stderr call -----------------------------1375127.0.0.1 - - [16/Oct/2026 21:21:57] "POST /auth.test?team_id=T111 HTTP/1.1" 200 -1376127.0.0.1 - - [16/Oct/2026 21:21:57] "POST /assistant.threads.setStatus HTTP/1.1" 200 -1377------------------------------ Captured log call -------------------------------13782026-10-16 21:21:57 DEBUG Applying slack_bolt.middleware.ssl_check.async_ssl_check.AsyncSslCheck13792026-10-16 21:21:57 DEBUG Applying slack_bolt.middleware.request_verification.async_request_verification.AsyncRequestVerification13802026-10-16 21:21:57 DEBUG Applying slack_bolt.middleware.authorization.async_single_team_authorization.AsyncSingleTeamAuthorization13812026-10-16 21:21:57 DEBUG Sending a request - url: POST http://localhost:8888/auth.test, params: {'team_id': 'T111'}, files: {}, data: {}, json: {}, proxy: {}, headers: {'Content-Type': 'application/x-www-form-urlencoded', 'Authorization': '(redacted)', 'User-Agent': 'Python/3.14.7 slackclient/3.45.0 Darwin/25.6.0'}13822026-10-16 21:21:57 DEBUG Received the following response - status: 200, headers: {'Server': 'SimpleHTTP/0.6 Python/3.14.7', 'Date': 'Fri, 16 Oct 2026 21:21:57 GMT', 'x-oauth-scopes': 'chat:write,commands', 'Content-Type': 'application/json;charset=utf-8', 'Content-Length': '174'}, body: {'ok': True, 'url': 'https://subarachnoid.slack.com/', 'team': 'Subarachnoid Workspace', 'user': 'bot', 'team_id': 'T0G9PQBBK', 'user_id': 'W23456789', 'bot_id': 'BZYBOTHED'}13832026-10-16 21:21:57 DEBUG Applying slack_bolt.middleware.ignoring_self_events.async_ignoring_self_events.AsyncIgnoringSelfEvents13842026-10-16 21:21:57 DEBUG Applying slack_bolt.middleware.url_verification.async_url_verification.AsyncUrlVerification13852026-10-16 21:21:57 DEBUG Applying slack_bolt.middleware.attaching_function_token.async_attaching_function_token.AsyncAttachingFunctionToken13862026-10-16 21:21:57 DEBUG Checking listener: handle_message ...13872026-10-16 21:21:57 DEBUG Running listener: handle_message ...13882026-10-16 21:21:57 DEBUG Responding with status: 200 body: "" (0 millis)13892026-10-16 21:21:57 DEBUG Sending a request - url: POST http://localhost:8888/assistant.threads.setStatus, params: {}, files: {}, data: {}, json: {'channel_id': 'D111', 'thread_ts': '1726133698.626339', 'status': 'is typing...', 'team_id': 'T111'}, proxy: {}, headers: {'Content-Type': 'application/json;charset=utf-8', 'Authorization': '(redacted)', 'User-Agent': 'Python/3.14.7 slackclient/3.45.0 Darwin/25.6.0'}13902026-10-16 21:21:57 INFO request: /assistant.threads.setStatus {'channel_id': 'D111', 'thread_ts': '1726133698.626339', 'status': 'is typing...', 'team_id': 'T111'}13912026-10-16 21:21:57 DEBUG Received the following response - status: 200, headers: {'Server': 'SimpleHTTP/0.6 Python/3.14.7', 'Date': 'Fri, 16 Oct 2026 21:21:57 GMT', 'Content-Type': 'application/json;charset=utf-8', 'Content-Length': '12'}, body: {'ok': True}1392_ TestAsyncEventsAssistantWithoutMiddleware.test_user_message_with_assistant_thread _13931394fut = <coroutine object Event.wait at 0x11163b840>, timeout = 0.113951396 async def wait_for(fut, timeout):1397 """Wait for the single Future or coroutine to complete, with timeout.1398 1399 Coroutine will be wrapped in Task.1400 1401 Returns result of the Future or coroutine. When a timeout occurs,1402 it cancels the task and raises TimeoutError. To avoid the task1403 cancellation, wrap it in shield().1404 1405 If the wait is cancelled, the task is also cancelled.1406 1407 If the task suppresses the cancellation and returns a value instead,1408 that value is returned.1409 1410 This function is a coroutine.1411 """1412 # The special case for timeout <= 0 is for the following case:1413 #1414 # async def test_waitfor():1415 # func_started = False1416 #1417 # async def func():1418 # nonlocal func_started1419 # func_started = True1420 #1421 # try:1422 # await asyncio.wait_for(func(), 0)1423 # except asyncio.TimeoutError:1424 # assert not func_started1425 # else:1426 # assert False1427 #1428 # asyncio.run(test_waitfor())1429 1430 1431 if timeout is not None and timeout <= 0:1432 fut = ensure_future(fut)1433 1434 if fut.done():1435 return fut.result()1436 1437 await _cancel_and_wait(fut)1438 try:1439 return fut.result()1440 except exceptions.CancelledError as exc:1441 raise TimeoutError from exc1442 1443 async with timeouts.timeout(timeout):1444> return await fut1445 ^^^^^^^^^14461447/nix/store/0kcws5blwbdyxqxjd1w8hjipz61xny3k-python3-3.14.7/lib/python3.14/asyncio/tasks.py:488: 1448_ _ _ _ _ _ _ _ _ _ _ _ _ _ _ _ _ _ _ _ _ _ _ _ _ _ _ _ _ _ _ _ _ _ _ _ _ _ _ _ 14491450self = <asyncio.locks.Event object at 0x111a64d70 [unset]>14511452 async def wait(self):1453 """Block until the internal flag is true.1454 1455 If the internal flag is true on entry, return True1456 immediately. Otherwise, block until another task calls1457 set() to set the flag to true, then return True.1458 """1459 if self._value:1460 return True1461 1462 fut = self._get_loop().create_future()1463 self._waiters.append(fut)1464 try:1465> await fut1466E asyncio.exceptions.CancelledError14671468/nix/store/0kcws5blwbdyxqxjd1w8hjipz61xny3k-python3-3.14.7/lib/python3.14/asyncio/locks.py:213: CancelledError14691470The above exception was the direct cause of the following exception:14711472self = <tests.scenario_tests_async.test_events_assistant_without_middleware.TestAsyncEventsAssistantWithoutMiddleware object at 0x1109a2190>14731474 @pytest.mark.asyncio1475 async def test_user_message_with_assistant_thread(self):1476 app = AsyncApp(client=self.web_client)1477 listener_called = asyncio.Event()1478 1479 @app.message("")1480 async def handle_message(1481 say: AsyncSay,1482 set_status: AsyncSetStatus,1483 set_title: AsyncSetTitle,1484 set_suggested_prompts: AsyncSetSuggestedPrompts,1485 get_thread_context: AsyncGetThreadContext,1486 save_thread_context: AsyncSaveThreadContext,1487 context: AsyncBoltContext,1488 ):1489 assert context.channel_id == "D111"1490 assert context.thread_ts == "1726133698.626339"1491 assert say.thread_ts == context.thread_ts1492 assert set_status is not None1493 assert set_title is not None1494 assert set_suggested_prompts is not None1495 assert get_thread_context is not None1496 assert save_thread_context is not None1497 try:1498 await set_status("is typing...")1499 await say("Here you are!")1500 listener_called.set()1501 except Exception as e:1502 await say(f"Oops, something went wrong (error: {e})")1503 1504 request = AsyncBoltRequest(body=user_message_event_body_with_assistant_thread, mode="socket_mode")1505 response = await app.async_dispatch(request)1506 assert response.status == 2001507> assert (await asyncio.wait_for(listener_called.wait(), timeout=0.1)) is True1508 ^^^^^^^^^^^^^^^^^^^^^^^^^^^^^^^^^^^^^^^^^^^^^^^^^^^^^^^^^^^15091510tests/scenario_tests_async/test_events_assistant_without_middleware.py:181: 1511_ _ _ _ _ _ _ _ _ _ _ _ _ _ _ _ _ _ _ _ _ _ _ _ _ _ _ _ _ _ _ _ _ _ _ _ _ _ _ _ 1512/nix/store/0kcws5blwbdyxqxjd1w8hjipz61xny3k-python3-3.14.7/lib/python3.14/asyncio/tasks.py:487: in wait_for1513 async with timeouts.timeout(timeout):1514 ^^^^^^^^^^^^^^^^^^^^^^^^^1515_ _ _ _ _ _ _ _ _ _ _ _ _ _ _ _ _ _ _ _ _ _ _ _ _ _ _ _ _ _ _ _ _ _ _ _ _ _ _ _ 15161517self = <Timeout [expired]>1518exc_type = <class 'asyncio.exceptions.CancelledError'>1519exc_val = CancelledError(), exc_tb = <traceback object at 0x111c28ac0>15201521 async def __aexit__(1522 self,1523 exc_type: type[BaseException] | None,1524 exc_val: BaseException | None,1525 exc_tb: TracebackType | None,1526 ) -> bool | None:1527 assert self._state in (_State.ENTERED, _State.EXPIRING)1528 1529 if self._timeout_handler is not None:1530 self._timeout_handler.cancel()1531 self._timeout_handler = None1532 1533 if self._state is _State.EXPIRING:1534 self._state = _State.EXPIRED1535 1536 if self._task.uncancel() <= self._cancelling and exc_type is not None:1537 # Since there are no new cancel requests, we're1538 # handling this.1539 if issubclass(exc_type, exceptions.CancelledError):1540> raise TimeoutError from exc_val1541E TimeoutError15421543/nix/store/0kcws5blwbdyxqxjd1w8hjipz61xny3k-python3-3.14.7/lib/python3.14/asyncio/timeouts.py:115: TimeoutError1544------------------------------ Captured log setup ------------------------------15452026-10-16 21:21:58 DEBUG Using selector: KqueueSelector1546----------------------------- Captured stderr call -----------------------------1547127.0.0.1 - - [16/Oct/2026 21:21:58] "POST /auth.test?team_id=T111 HTTP/1.1" 200 -1548127.0.0.1 - - [16/Oct/2026 21:21:58] "POST /assistant.threads.setStatus HTTP/1.1" 200 -1549127.0.0.1 - - [16/Oct/2026 21:21:58] "GET /conversations.replies?channel=D111&ts=1726133698.626339&include_all_metadata=1&limit=4&oldest=1726133698.626339&team_id=T111 HTTP/1.1" 200 -1550------------------------------ Captured log call -------------------------------15512026-10-16 21:21:58 DEBUG Applying slack_bolt.middleware.ssl_check.async_ssl_check.AsyncSslCheck15522026-10-16 21:21:58 DEBUG Applying slack_bolt.middleware.request_verification.async_request_verification.AsyncRequestVerification15532026-10-16 21:21:58 DEBUG Applying slack_bolt.middleware.authorization.async_single_team_authorization.AsyncSingleTeamAuthorization15542026-10-16 21:21:58 DEBUG Sending a request - url: POST http://localhost:8888/auth.test, params: {'team_id': 'T111'}, files: {}, data: {}, json: {}, proxy: {}, headers: {'Content-Type': 'application/x-www-form-urlencoded', 'Authorization': '(redacted)', 'User-Agent': 'Python/3.14.7 slackclient/3.45.0 Darwin/25.6.0'}15552026-10-16 21:21:58 DEBUG Received the following response - status: 200, headers: {'Server': 'SimpleHTTP/0.6 Python/3.14.7', 'Date': 'Fri, 16 Oct 2026 21:21:58 GMT', 'x-oauth-scopes': 'chat:write,commands', 'Content-Type': 'application/json;charset=utf-8', 'Content-Length': '174'}, body: {'ok': True, 'url': 'https://subarachnoid.slack.com/', 'team': 'Subarachnoid Workspace', 'user': 'bot', 'team_id': 'T0G9PQBBK', 'user_id': 'W23456789', 'bot_id': 'BZYBOTHED'}15562026-10-16 21:21:58 DEBUG Applying slack_bolt.middleware.ignoring_self_events.async_ignoring_self_events.AsyncIgnoringSelfEvents15572026-10-16 21:21:58 DEBUG Applying slack_bolt.middleware.url_verification.async_url_verification.AsyncUrlVerification15582026-10-16 21:21:58 DEBUG Applying slack_bolt.middleware.attaching_function_token.async_attaching_function_token.AsyncAttachingFunctionToken15592026-10-16 21:21:58 DEBUG Checking listener: handle_message ...15602026-10-16 21:21:58 DEBUG Running listener: handle_message ...15612026-10-16 21:21:58 DEBUG Responding with status: 200 body: "" (0 millis)15622026-10-16 21:21:58 DEBUG Sending a request - url: POST http://localhost:8888/assistant.threads.setStatus, params: {}, files: {}, data: {}, json: {'channel_id': 'D111', 'thread_ts': '1726133698.626339', 'status': 'is typing...', 'team_id': 'T111'}, proxy: {}, headers: {'Content-Type': 'application/json;charset=utf-8', 'Authorization': '(redacted)', 'User-Agent': 'Python/3.14.7 slackclient/3.45.0 Darwin/25.6.0'}15632026-10-16 21:21:58 INFO request: /assistant.threads.setStatus {'channel_id': 'D111', 'thread_ts': '1726133698.626339', 'status': 'is typing...', 'team_id': 'T111'}15642026-10-16 21:21:58 DEBUG Received the following response - status: 200, headers: {'Server': 'SimpleHTTP/0.6 Python/3.14.7', 'Date': 'Fri, 16 Oct 2026 21:21:58 GMT', 'Content-Type': 'application/json;charset=utf-8', 'Content-Length': '12'}, body: {'ok': True}15652026-10-16 21:21:58 DEBUG Sending a request - url: GET http://localhost:8888/conversations.replies, params: {'channel': 'D111', 'ts': '1726133698.626339', 'include_all_metadata': '1', 'limit': 4, 'oldest': '1726133698.626339', 'team_id': 'T111'}, files: {}, data: {}, json: {}, proxy: {}, headers: {'Content-Type': 'application/x-www-form-urlencoded', 'Authorization': '(redacted)', 'User-Agent': 'Python/3.14.7 slackclient/3.45.0 Darwin/25.6.0'}15662026-10-16 21:21:58 INFO request: /conversations.replies {'channel': 'D111', 'ts': '1726133698.626339', 'include_all_metadata': '1', 'limit': '4', 'oldest': '1726133698.626339', 'team_id': 'T111'}15672026-10-16 21:21:58 DEBUG Received the following response - status: 200, headers: {'Server': 'SimpleHTTP/0.6 Python/3.14.7', 'Date': 'Fri, 16 Oct 2026 21:21:58 GMT', 'Content-Type': 'application/json;charset=utf-8', 'Content-Length': '12'}, body: {'ok': True}15682026-10-16 21:21:58 DEBUG Sending a request - url: POST http://localhost:8888/chat.postMessage, params: {}, files: {}, data: {}, json: {'channel': 'D111', 'text': 'Here you are!', 'thread_ts': '1726133698.626339', 'metadata': {'event_type': 'assistant_thread_context', 'event_payload': None}, 'team_id': 'T111'}, proxy: {}, headers: {'Content-Type': 'application/json;charset=utf-8', 'Authorization': '(redacted)', 'User-Agent': 'Python/3.14.7 slackclient/3.45.0 Darwin/25.6.0'}1569=============================== warnings summary ===============================1570tests/adapter_tests/starlette/test_fastapi.py:91571 /nix/var/nix/builds/nix-16169-4100965297/source/tests/adapter_tests/starlette/test_fastapi.py:9: StarletteDeprecationWarning: Using `httpx` with `starlette.testclient` is deprecated; install `httpx2` instead.1572 from starlette.testclient import TestClient15731574tests/adapter_tests_async/test_async_sanic.py::TestSanic::test_events1575 /nix/store/qphycimyf4fkkgccd20n0l7sjmww2pdj-python3.14-websockets-16.1/lib/python3.14/site-packages/websockets/legacy/__init__.py:6: DeprecationWarning: websockets.legacy is deprecated; see https://websockets.readthedocs.io/en/stable/howto/upgrade.html for upgrade instructions1576 warnings.warn( # deprecated in 14.0 - 2024-11-0915771578tests/scenario_tests/test_workflow_steps.py: 13 warnings1579tests/scenario_tests/test_workflow_steps_decorator_simple.py: 6 warnings1580tests/scenario_tests/test_workflow_steps_decorator_with_args.py: 8 warnings1581 /nix/var/nix/builds/nix-16169-4100965297/source/slack_bolt/app/app.py:750: DeprecationWarning: Steps from apps for legacy workflows are now deprecated. Use new custom steps: https://docs.slack.dev/workflows/workflow-steps/1582 warnings.warn(15831584tests/scenario_tests/test_workflow_steps.py::TestWorkflowSteps::test_save1585tests/scenario_tests/test_workflow_steps.py::TestWorkflowSteps::test_save_process_before_response1586tests/scenario_tests/test_workflow_steps_decorator_simple.py::TestWorkflowStepsDecorator::test_save1587tests/scenario_tests/test_workflow_steps_decorator_with_args.py::TestWorkflowStepsDecorator::test_save1588tests/scenario_tests_async/test_workflow_steps.py::TestAsyncWorkflowSteps::test_save1589tests/scenario_tests_async/test_workflow_steps.py::TestAsyncWorkflowSteps::test_save_process_before_response1590tests/scenario_tests_async/test_workflow_steps_decorator_simple.py::TestAsyncWorkflowStepsDecorator::test_save1591tests/scenario_tests_async/test_workflow_steps_decorator_with_args.py::TestAsyncWorkflowStepsDecorator::test_save1592tests/scenario_tests_async/test_workflow_steps_decorator_with_args.py::TestAsyncWorkflowStepsDecorator::test_logger_propagation1593 /nix/store/2i9qkh1y35px2v4wr6b21v46g0fmzgbs-python3.14-slack-sdk-3.45.0/lib/python3.14/site-packages/slack_sdk/web/deprecation.py:52: UserWarning: workflows.updateStep is deprecated. For more info, go to https://docs.slack.dev/changelog/2023-08-workflow-steps-from-apps-step-back/1594 warnings.warn(message)15951596tests/scenario_tests/test_workflow_steps.py::TestWorkflowSteps::test_execute1597tests/scenario_tests/test_workflow_steps.py::TestWorkflowSteps::test_execute_process_before_response1598tests/scenario_tests/test_workflow_steps_decorator_simple.py::TestWorkflowStepsDecorator::test_execute1599tests/scenario_tests/test_workflow_steps_decorator_with_args.py::TestWorkflowStepsDecorator::test_execute1600tests/scenario_tests_async/test_workflow_steps.py::TestAsyncWorkflowSteps::test_execute1601tests/scenario_tests_async/test_workflow_steps.py::TestAsyncWorkflowSteps::test_execute_process_before_response1602tests/scenario_tests_async/test_workflow_steps_decorator_simple.py::TestAsyncWorkflowStepsDecorator::test_execute1603tests/scenario_tests_async/test_workflow_steps_decorator_with_args.py::TestAsyncWorkflowStepsDecorator::test_execute1604tests/scenario_tests_async/test_workflow_steps_decorator_with_args.py::TestAsyncWorkflowStepsDecorator::test_logger_propagation1605 /nix/store/2i9qkh1y35px2v4wr6b21v46g0fmzgbs-python3.14-slack-sdk-3.45.0/lib/python3.14/site-packages/slack_sdk/web/deprecation.py:52: UserWarning: workflows.stepCompleted is deprecated. For more info, go to https://docs.slack.dev/changelog/2023-08-workflow-steps-from-apps-step-back/1606 warnings.warn(message)16071608tests/scenario_tests/test_workflow_steps.py::TestWorkflowSteps::test_execute1609tests/scenario_tests/test_workflow_steps_decorator_simple.py::TestWorkflowStepsDecorator::test_execute1610tests/scenario_tests/test_workflow_steps_decorator_with_args.py::TestWorkflowStepsDecorator::test_execute1611tests/scenario_tests_async/test_workflow_steps.py::TestAsyncWorkflowSteps::test_execute1612tests/scenario_tests_async/test_workflow_steps_decorator_simple.py::TestAsyncWorkflowStepsDecorator::test_execute1613tests/scenario_tests_async/test_workflow_steps_decorator_with_args.py::TestAsyncWorkflowStepsDecorator::test_execute1614 /nix/store/2i9qkh1y35px2v4wr6b21v46g0fmzgbs-python3.14-slack-sdk-3.45.0/lib/python3.14/site-packages/slack_sdk/web/deprecation.py:52: UserWarning: workflows.stepFailed is deprecated. For more info, go to https://docs.slack.dev/changelog/2023-08-workflow-steps-from-apps-step-back/1615 warnings.warn(message)16161617tests/scenario_tests_async/test_workflow_steps.py: 13 warnings1618tests/scenario_tests_async/test_workflow_steps_decorator_simple.py: 6 warnings1619tests/scenario_tests_async/test_workflow_steps_decorator_with_args.py: 8 warnings1620 /nix/var/nix/builds/nix-16169-4100965297/source/slack_bolt/app/async_app.py:773: DeprecationWarning: Steps from apps for legacy workflows are now deprecated. Use new custom steps: https://docs.slack.dev/workflows/workflow-steps/1621 warnings.warn(16221623tests/slack_bolt_async/authorization/test_async_authorize.py::TestAsyncAuthorize::test_fetch_different_user_token_with_rotation1624tests/slack_bolt_async/authorization/test_async_authorize.py::TestAsyncAuthorize::test_fetch_different_user_token_with_rotation1625tests/slack_bolt_async/authorization/test_async_authorize.py::TestAsyncAuthorize::test_rotate_only_bot_token1626tests/slack_bolt_async/oauth/test_async_oauth_flow.py::TestAsyncOAuthFlow::test_handle_callback1627tests/slack_bolt_async/oauth/test_async_oauth_flow.py::TestAsyncOAuthFlow::test_handle_callback_no_state_validation1628tests/slack_bolt_async/oauth/test_async_oauth_flow.py::TestAsyncOAuthFlow::test_handle_callback_using_options1629tests/slack_bolt_async/oauth/test_async_oauth_flow_sqlite3.py::TestAsyncOAuthFlowSQLite3::test_handle_callback1630tests/slack_bolt_async/oauth/test_async_oauth_flow_sqlite3.py::TestAsyncOAuthFlowSQLite3::test_handle_callback_using_options1631 /nix/store/2i9qkh1y35px2v4wr6b21v46g0fmzgbs-python3.14-slack-sdk-3.45.0/lib/python3.14/site-packages/slack_sdk/web/async_base_client.py:149: DeprecationWarning: BasicAuth is deprecated and will be removed in aiohttp 4.0; use aiohttp.encode_basic_auth() with headers={'Authorization': ...} instead1632 auth = BasicAuth(auth["client_id"], auth["client_secret"]) # type: ignore[assignment]16331634-- Docs: https://docs.pytest.org/en/stable/how-to/capture-warnings.html1635=========================== short test summary info ============================1636FAILED tests/scenario_tests_async/test_events_assistant_without_middleware.py::TestAsyncEventsAssistantWithoutMiddleware::test_user_message - TimeoutError1637FAILED tests/scenario_tests_async/test_events_assistant_without_middleware.py::TestAsyncEventsAssistantWithoutMiddleware::test_user_message_with_assistant_thread - TimeoutError1638==== 2 failed, 853 passed, 77 deselected, 88 warnings in 151.33s (0:02:31) =====