numtide/llm-agents.nix build #7908 failed ← #7907 #7909 →
eval warnings
4 kinds
· 8 occurrences
- warn setting 'accept-flake-config' is ignored: iets never applies a flake's nixConfig, so a flake that sets extra-substituters or allow-import-from-derivation there runs without them; put the settings in nix.conf ×1
- warn setting 'plugin-files' is ignored: iets loads no plugins ×1
- warn stdenv.isLinux is deprecated, use stdenv.hostPlatform.isLinux instead ×3
- warn stdenv.isDarwin is deprecated, use stdenv.hostPlatform.isDarwin instead ×3
6 failed
| status | attribute | duration |
|---|---|---|
checks.aarch64-darwin.pkgs-hermes-agent
|
24s | |
source: 0 0 0 0 0 0 0 0 0 0 0 0 0 0 0 0 0 …source: 0 0 0 0 0 0 0 0 0 0 0 0 0 0 0 0 0 0 0 0 0 0 0 0 0 0 0 0 0 0 0 0 0 0 0 0 100 5.16M 100 5.16M 0 0 15.69M 0 0 100 5.16M 100 5.16M 0 0 15.68M 0 0 100 5.16M 100 5.16M 0 0 15.68M 0 0 unpacking source archive /nix/var/nix/builds/nix-40939-2425095757/download.tar.gz |
||
checks.aarch64-darwin.pkgs-hermes-desktop
|
12s | |
source: 0 0 0 0 0 0 0 0 0 0 0 0 0 0 0 0 0 …source: 0 0 0 0 0 0 0 0 0 0 0 0 0 0 0 0 0 0 0 0 0 0 0 0 0 0 0 0 0 0 0 0 0 0 0 0 100 5.16M 0 5.16M 0 0 4.34M 0 00:01 0 100 5.16M 0 5.16M 0 0 4.34M 0 00:01 0 100 5.16M 0 5.16M 0 0 4.34M 0 00:01 0 unpacking source archive /nix/var/nix/builds/nix-40846-1673727311/download.tar.gz |
||
checks.aarch64-linux.pkgs-hermes-agent
|
18s | |
source: 0 0 0 0 0 0 0 0 0 0 0 0 0 0 0 0 0 …source: 0 0 0 0 0 0 0 0 0 0 0 0 0 0 0 0 0 0 0 0 0 0 0 0 0 0 0 0 0 0 0 0 0 0 0 0 100 5.16M 100 5.16M 0 0 10.08M 0 0 100 5.16M 100 5.16M 0 0 10.08M 0 0 100 5.16M 100 5.16M 0 0 10.08M 0 0 unpacking source archive /build/download.tar.gz |
||
checks.aarch64-linux.pkgs-hermes-desktop
|
29s | |
source: 0 0 0 0 0 0 0 0 0 0 0 0 0 0 0 0 0 …source: 0 0 0 0 0 0 0 0 0 0 0 0 0 0 0 0 0 0 0 0 0 0 0 0 0 0 0 0 0 0 0 0 0 0 0 0 100 5.16M 100 5.16M 0 0 15.84M 0 0 100 5.16M 100 5.16M 0 0 15.83M 0 0 100 5.16M 100 5.16M 0 0 15.83M 0 0 unpacking source archive /build/download.tar.gz |
||
checks.x86_64-linux.pkgs-hermes-agent
|
4s | |
setup: error: hash mismatch in fixed-output derivation '/nix/store/lb72zp72v8v4crn64nwvhz2s40r2alry-source.drv': specified: sha256-7qt44AFvBkLBWhXO235b …setup: error: hash mismatch in fixed-output derivation '/nix/store/lb72zp72v8v4crn64nwvhz2s40r2alry-source.drv': specified: sha256-7qt44AFvBkLBWhXO235bUxdNYwHYdiizYBmqT/Bs9Lc= got: sha256-f57Y+bp8q3r9OvY6EVgOHNucW4mXip/Cb6ey99JhP/Y= error: build of resolved derivation '/nix/store/lb72zp72v8v4crn64nwvhz2s40r2alry-source.drv' failed error: Cannot build '/nix/store/fqn0qc7h8k10gmvwghrn6nxj4ldn7ixl-nemo-relay-0.10.2-vendor-staging.drv'. Reason: 1 dependency failed. Output paths: /nix/store/i893w7zzgx7j42xdz0d3pg91b8m53qwy-nemo-relay-0.10.2-vendor-staging error: Cannot build '/nix/store/1nfrlips82w5pb3jn2k78c378m4kriqv-nemo-relay-0.10.2-vendor.drv'. Reason: 1 dependency failed. Output paths: /nix/store/7abqp0kxljjl5x2ikz84ig8l1qnydzrh-nemo-relay-0.10.2-vendor error: Cannot build '/nix/store/07pqq9canghkzk1xi68zgdp3ylc2cw8x-python3.14-nemo-relay-0.10.2.drv'. Reason: 2 dependencies failed. Output paths: /nix/store/4qvhllm15n8a0ia4kpl8hgnr1a5b3pah-python3.14-nemo-relay-0.10.2 /nix/store/fhxw4bpgymq4mp39hqy6msxw4pggrkfj-python3.14-nemo-relay-0.10.2-dist error: Cannot build '/nix/store/wrghavcnn719s2xh7m0xm9jdipjs6js1-python3-3.14.7-env.drv'. Reason: 1 dependency failed. Output paths: /nix/store/6hi0xw05hyzj33l048gs3n17qbwr8zqf-python3-3.14.7-env error: Cannot build '/nix/store/zbc40gm55n5wqg92k8rclpbg0fnfaaxg-hermes-agent-0.22.2.drv'. Reason: 2 dependencies failed. Output paths: /nix/store/1anq917gzj70hw60grxfvsb6alm5xd8a-hermes-agent-0.22.2 /nix/store/b9llx7c1cpgi3d45fif3w9jg97c41q8k-hermes-agent-0.22.2-dist error: Cannot build '/nix/store/kgnf0pw71qi2cgmc9hqi9k1daz9bzfma-check-hermes-agent.drv'. Reason: 1 dependency failed. Output paths: /nix/store/cym8sr4gzblh8iiypspq7g8dc26fpg86-check-hermes-agent |
||
checks.x86_64-linux.pkgs-hermes-desktop
|
33s | |
setup: error: build of resolved derivation '/nix/store/lb72zp72v8v4crn64nwvhz2s40r2alry-source.drv' failed error: Cannot build '/nix/store/fqn0qc7h8k10gmvwghrn6 …setup: error: build of resolved derivation '/nix/store/lb72zp72v8v4crn64nwvhz2s40r2alry-source.drv' failed error: Cannot build '/nix/store/fqn0qc7h8k10gmvwghrn6nxj4ldn7ixl-nemo-relay-0.10.2-vendor-staging.drv'. Reason: 1 dependency failed. Output paths: /nix/store/i893w7zzgx7j42xdz0d3pg91b8m53qwy-nemo-relay-0.10.2-vendor-staging error: Cannot build '/nix/store/1nfrlips82w5pb3jn2k78c378m4kriqv-nemo-relay-0.10.2-vendor.drv'. Reason: 1 dependency failed. Output paths: /nix/store/7abqp0kxljjl5x2ikz84ig8l1qnydzrh-nemo-relay-0.10.2-vendor error: Cannot build '/nix/store/07pqq9canghkzk1xi68zgdp3ylc2cw8x-python3.14-nemo-relay-0.10.2.drv'. Reason: 2 dependencies failed. Output paths: /nix/store/4qvhllm15n8a0ia4kpl8hgnr1a5b3pah-python3.14-nemo-relay-0.10.2 /nix/store/fhxw4bpgymq4mp39hqy6msxw4pggrkfj-python3.14-nemo-relay-0.10.2-dist error: Cannot build '/nix/store/wrghavcnn719s2xh7m0xm9jdipjs6js1-python3-3.14.7-env.drv'. Reason: 1 dependency failed. Output paths: /nix/store/6hi0xw05hyzj33l048gs3n17qbwr8zqf-python3-3.14.7-env error: Cannot build '/nix/store/zbc40gm55n5wqg92k8rclpbg0fnfaaxg-hermes-agent-0.22.2.drv'. Reason: 2 dependencies failed. Output paths: /nix/store/1anq917gzj70hw60grxfvsb6alm5xd8a-hermes-agent-0.22.2 /nix/store/b9llx7c1cpgi3d45fif3w9jg97c41q8k-hermes-agent-0.22.2-dist error: Cannot build '/nix/store/00bg3a0yf9rg3nvp41c26xkm97v2arhn-hermes-desktop-0.22.2.drv'. Reason: 1 dependency failed. Output paths: /nix/store/n75qyfr1vlskdsvra7ad7wr1m3ps3fsv-hermes-desktop-0.22.2 error: Cannot build '/nix/store/1yys1pbg711axdsa1mx08kwf8rsyps7k-check-hermes-desktop.drv'. Reason: 1 dependency failed. Output paths: /nix/store/kwrw78sa8yw6mj3ckxgvb4ds434iazwb-check-hermes-desktop |
||
13 succeeded
| status | attribute | duration |
|---|---|---|
| loading… | ||
679 already built
| status | attribute | duration |
|---|---|---|
| loading… | ||