nixbot

builds

numtide/llm-agents.nix build #7870 failed

branch main · PR #10872 · commit 4056f7797d · · took 30m 41s · eval 52s

eval warnings 4 kinds · 8 occurrences
  • warn setting 'accept-flake-config' is ignored: iets never applies a flake's nixConfig, so a flake that sets extra-substituters or allow-import-from-derivation there runs without them; put the settings in nix.conf ×1
  • warn setting 'plugin-files' is ignored: iets loads no plugins ×1
  • warn stdenv.isLinux is deprecated, use stdenv.hostPlatform.isLinux instead ×3
  • warn stdenv.isDarwin is deprecated, use stdenv.hostPlatform.isDarwin instead ×3

9 failed
failed attributes
status attribute duration
failed checks.aarch64-darwin.pkgs-agent-slack 2m 36s
setup: /nix/store/yjs5jaf2n4kz89izqchym3n9ywy2j72f-bun-pkg--oxlint-binding-openharmony-arm64-1.49.0.drv /nix/store/zbjmc98ysbng80wgq9gp7j0sghv3fsb0-bun-pkg- …
setup:
  /nix/store/yjs5jaf2n4kz89izqchym3n9ywy2j72f-bun-pkg--oxlint-binding-openharmony-arm64-1.49.0.drv
  /nix/store/zbjmc98ysbng80wgq9gp7j0sghv3fsb0-bun-pkg-bun-types-1.3.9.drv
  /nix/store/zgvf6lj0py1ycp2vwpnjh19wk5s1gs51-bun-pkg--oxlint-binding-win32-ia32-msvc-1.49.0.drv
  /nix/store/kslvnx7jar4hl7sxa3s06lcj0bk0b12v-bun-cache.drv
  /nix/store/06nd3cpp49rvxbjjb0m7ixkvpy1yqh2l-agent-slack-0.10.2.drv
  /nix/store/car7rzmvycz12k85gpkjgnrfbcbxj7l3-check-agent-slack.drv
could not copy /nix/store/pxkx7p0wh3g4mql9523dp6lrvznqhi2w-bun-pkg--oxfmt-binding-android-arm-eabi-0.31.0: error: gRPC FetchNars failed: failed to connect to all addresses; last error: UNKNOWN: ipv4:65.21.215.17:50051: handshaker shutdown
error: some outputs are unexpectedly invalid
failed checks.aarch64-linux.pkgs-claude-desktop 38s
setup: these 4 derivations will be built: /nix/store/2dl5sz6df93wmc13s7vlh7j6al32k2s7-claude-desktop-2.42304.0-fhsenv-rootfs.drv /nix/store/712d8sdglqnkfcni …
setup:
these 4 derivations will be built:
  /nix/store/2dl5sz6df93wmc13s7vlh7j6al32k2s7-claude-desktop-2.42304.0-fhsenv-rootfs.drv
  /nix/store/712d8sdglqnkfcnij5aqq8qd4si0n7kh-claude-desktop-2.42304.0-bwrap.drv
  /nix/store/pimh6afwyk3a3scxzg5qxsqyjpnamf6v-claude-desktop-2.42304.0.drv
  /nix/store/mr77g4ghkjgipfqh275qmxwfdrsav5v9-check-claude-desktop.drv
could not copy /nix/store/i8z7faff5pg8d71l6f8diw002zgpq4v3-claude-desktop-2.42304.0-fhsenv-rootfs: error: gRPC FetchNars failed: failed to connect to all addresses; last error: UNKNOWN: ipv4:65.21.215.17:50051: handshaker shutdown
error: some outputs are unexpectedly invalid
failed checks.aarch64-linux.pkgs-qmd 8m 24s
setup: /nix/store/3rfcg44w2p6fh42d38xhf6129jahxwkm-bun-cache.drv /nix/store/yxra3fnxv0frcab10d416c30z4n0zqfd-qmd-2.8.3.drv /nix/store/4cafwfhhinfn3033q5ll …
setup:
  /nix/store/3rfcg44w2p6fh42d38xhf6129jahxwkm-bun-cache.drv
  /nix/store/yxra3fnxv0frcab10d416c30z4n0zqfd-qmd-2.8.3.drv
  /nix/store/4cafwfhhinfn3033q5ll5xqlnsxf4gy0-check-qmd.drv
these 2 paths will be fetched (0.0 KiB download, 6.1 KiB unpacked):
  /nix/store/al89rg4yhzybbqhfr1bh1hz26hz7slnh-deep-eql-4.0.2.tgz
  /nix/store/lmf2n50zvpk5z4x4khi2887jgv09cfxf-estree-walker-3.0.3.tgz
could not copy /nix/store/wlrjwlv7m2im9g07gzwmgkkxnsmp0rjz-bun-pkg--esbuild-linux-s390x-0.27.3: error: gRPC FetchNars failed: failed to connect to all addresses; last error: UNKNOWN: ipv4:65.21.215.17:50051: connection attempt timed out before receiving SETTINGS frame
error: some outputs are unexpectedly invalid
failed checks.aarch64-linux.pkgs-t3code-desktop 36s
setup: these 4 derivations will be built: /nix/store/8zrxj6lk54pgdpn743zypzj7lwqqz70s-opencode-1.19.1.drv /nix/store/0v8qq5ikmxkgs0y1bc44jgbpgjr8f238-t3code …
setup:
these 4 derivations will be built:
  /nix/store/8zrxj6lk54pgdpn743zypzj7lwqqz70s-opencode-1.19.1.drv
  /nix/store/0v8qq5ikmxkgs0y1bc44jgbpgjr8f238-t3code-0.0.45.drv
  /nix/store/d8jdpywd7vxhk5wbsh8gr9z3wcmlaln9-t3code-desktop.drv
  /nix/store/av3xnvy3xc05w9vzrs12ayy2riif606q-check-t3code-desktop.drv
could not copy /nix/store/b0jsqdg0clw6kx22sqcfcsnbndpjpndc-opencode-1.19.1: error: gRPC FetchNars failed: failed to connect to all addresses; last error: UNKNOWN: ipv4:65.21.215.17:50051: tcp handshaker shutdown
error: some outputs are unexpectedly invalid
failed checks.aarch64-linux.treefmt 29s
treefmt-check: elastic-arm-8f6abe2e: building 1b803mn6x6kqfkyvh7rfwaf14sfsv0mb-treefmt-check.drv traversed 554 files emitted 375 files for processing formatted …
treefmt-check:
elastic-arm-8f6abe2e: building 1b803mn6x6kqfkyvh7rfwaf14sfsv0mb-treefmt-check.drv
traversed 554 files
emitted 375 files for processing
formatted 375 files (0 changed) in 5.728s
failed checks.x86_64-linux.pkgs-agent-browser 23m 41s
setup: these 2 derivations will be built: /nix/store/h5xxy5vxl6vw6wif2qnrnirha24b5ybb-agent-browser-0.39.1.drv /nix/store/3jdjzifspdnxvydi6vx9j9jypfj4rga8-c …
setup:
these 2 derivations will be built:
  /nix/store/h5xxy5vxl6vw6wif2qnrnirha24b5ybb-agent-browser-0.39.1.drv
  /nix/store/3jdjzifspdnxvydi6vx9j9jypfj4rga8-check-agent-browser.drv
error: timed out after 1200 seconds
error: Cannot build '/nix/store/3jdjzifspdnxvydi6vx9j9jypfj4rga8-check-agent-browser.drv'.
       Reason: 1 dependency failed.
       Output paths:
         /nix/store/148a4vckqblzfi53dyrj2j05c4rzxaa2-check-agent-browser
failed checks.x86_64-linux.pkgs-herdr 23m 25s
setup: these 2 derivations will be built: /nix/store/0kfzvssf8l8l136brmawjpzzykmqzkfb-herdr-0.9.5.drv /nix/store/h0i37rq2wxmjj8cfwyajzdndg2jc81vj-check-herd …
setup:
these 2 derivations will be built:
  /nix/store/0kfzvssf8l8l136brmawjpzzykmqzkfb-herdr-0.9.5.drv
  /nix/store/h0i37rq2wxmjj8cfwyajzdndg2jc81vj-check-herdr.drv
error: timed out after 1200 seconds
error: Cannot build '/nix/store/h0i37rq2wxmjj8cfwyajzdndg2jc81vj-check-herdr.drv'.
       Reason: 1 dependency failed.
       Output paths:
         /nix/store/1avid081b11bqi64xrfjax0wrwv9i2r4-check-herdr
failed checks.x86_64-linux.pkgs-officecli 20m 34s
setup: these 2 derivations will be built: /nix/store/6wkf8dsk74fbd2kyyz7lq6jklm2mgic2-officecli-1.0.157.drv /nix/store/s9rn79r51ar2q8vx4drfj97dd1d8sf91-chec …
setup:
these 2 derivations will be built:
  /nix/store/6wkf8dsk74fbd2kyyz7lq6jklm2mgic2-officecli-1.0.157.drv
  /nix/store/s9rn79r51ar2q8vx4drfj97dd1d8sf91-check-officecli.drv
error: timed out after 1200 seconds
error: Cannot build '/nix/store/s9rn79r51ar2q8vx4drfj97dd1d8sf91-check-officecli.drv'.
       Reason: 1 dependency failed.
       Output paths:
         /nix/store/qa633l121cjjyp8sxh3i5p51k2r94vhf-check-officecli
failed checks.x86_64-linux.pkgs-workmux 26m 10s
setup: these 2 derivations will be built: /nix/store/m12r69q6alfp7fc8lpf42l5413xs2kxp-workmux-0.1.276.drv /nix/store/y4kqg5npdfw3xviickz7qpx1956z1n9i-check- …
setup:
these 2 derivations will be built:
  /nix/store/m12r69q6alfp7fc8lpf42l5413xs2kxp-workmux-0.1.276.drv
  /nix/store/y4kqg5npdfw3xviickz7qpx1956z1n9i-check-workmux.drv
error: timed out after 1200 seconds
error: Cannot build '/nix/store/y4kqg5npdfw3xviickz7qpx1956z1n9i-check-workmux.drv'.
       Reason: 1 dependency failed.
       Output paths:
         /nix/store/cq6mq9h13hzd84hrgvmf99s8j1i7kwwj-check-workmux
30 succeeded
succeeded attributes
status attribute duration
loading…
659 already built
skipped attributes
status attribute duration
loading…