nixbot

builds

numtide/llm-agents.nix build #7864 failed

branch main · PR #10868 · commit 619b1e66af · · took 8m 45s · eval 19s

eval warnings 4 kinds · 8 occurrences
  • warn setting 'accept-flake-config' is ignored: iets never applies a flake's nixConfig, so a flake that sets extra-substituters or allow-import-from-derivation there runs without them; put the settings in nix.conf ×1
  • warn setting 'plugin-files' is ignored: iets loads no plugins ×1
  • warn stdenv.isLinux is deprecated, use stdenv.hostPlatform.isLinux instead ×3
  • warn stdenv.isDarwin is deprecated, use stdenv.hostPlatform.isDarwin instead ×3

2 failed
failed attributes
status attribute duration
failed checks.aarch64-darwin.pkgs-plannotator 8m 14s
setup: /nix/store/agnjnzfl07g9l4h397fx62vx1w4v69w7-yq-go-4.54.1 could not copy /nix/store/1amwhb4fjv2zr37ksfqfb3nm8625ny2g-bun-pkg--msgpackr-extract-msgpackr- …
setup:
  /nix/store/agnjnzfl07g9l4h397fx62vx1w4v69w7-yq-go-4.54.1
could not copy /nix/store/1amwhb4fjv2zr37ksfqfb3nm8625ny2g-bun-pkg--msgpackr-extract-msgpackr-extract-win32-x64-3.0.4: error: gRPC FetchNars failed: failed to connect to all addresses; last error: UNKNOWN: ipv4:65.21.215.17:50051: handshaker shutdown
warning: SQLite database '/nix/var/nix/db/db.sqlite' is busy
could not copy /nix/store/z05wmfiqx19qm10ls1haz2sbg9jc5qfx-bun-pkg-bignumber.js-9.3.1: error: gRPC FetchNars failed: failed to connect to all addresses; last error: UNKNOWN: ipv4:65.21.215.17:50051: handshaker shutdown
could not copy /nix/store/jsa4dk2n8rsxw72gcv1p7qi4p6sn6dvg-bun-pkg-crelt-1.0.7: error: gRPC FetchNars failed: failed to connect to all addresses; last error: UNKNOWN: ipv4:65.21.215.17:50051: tcp handshaker shutdown
warning: SQLite database '/nix/var/nix/db/db.sqlite' is busy
warning: SQLite database '/nix/var/nix/db/db.sqlite' is busy
error: some outputs are unexpectedly invalid
failed checks.aarch64-linux.pkgs-plannotator 8m 22s
setup: /nix/store/dddpx0mgg4fm13nrqw22a5g9ksv32lcf-check-plannotator.drv could not copy /nix/store/7lbhbhvpia4k41yb5vwcq0msqawypg81-bun-pkg--esbuild-openbsd-x …
setup:
  /nix/store/dddpx0mgg4fm13nrqw22a5g9ksv32lcf-check-plannotator.drv
could not copy /nix/store/7lbhbhvpia4k41yb5vwcq0msqawypg81-bun-pkg--esbuild-openbsd-x64-0.28.1: error: gRPC FetchNars failed: failed to connect to all addresses; last error: UNKNOWN: ipv4:65.21.215.17:50051: tcp handshaker shutdown
could not copy /nix/store/y0i84jrzl7ihj3h459gcr4bz1yrb04yp-bun-pkg--floating-ui-utils-0.2.12: error: gRPC FetchNars failed: failed to connect to all addresses; last error: UNKNOWN: ipv4:65.21.215.17:50051: handshaker shutdown
could not copy /nix/store/1ldlm5758pjy31vgkk3nc627md0b2fg3-bun-pkg--rolldown-binding-linux-ppc64-gnu-1.2.7: error: gRPC FetchNars failed: failed to connect to all addresses; last error: UNKNOWN: ipv4:65.21.215.17:50051: connection attempt timed out before receiving SETTINGS frame
could not copy /nix/store/as2kacz33i82qzc44las8j5m214fd43q-bun-pkg--rolldown-binding-linux-x64-gnu-1.2.7: error: gRPC FetchNars failed: failed to connect to all addresses; last error: UNKNOWN: ipv4:65.21.215.17:50051: handshaker shutdown
warning: SQLite database '/nix/var/nix/db/db.sqlite' is busy
warning: SQLite database '/nix/var/nix/db/db.sqlite' is busy
error: some outputs are unexpectedly invalid
13 succeeded
succeeded attributes
status attribute duration
loading…
683 already built
skipped attributes
status attribute duration
loading…