numtide/llm-agents.nix build #7757 failed ← #7756 #7758 →
eval warnings
4 kinds
· 8 occurrences
- warn setting 'accept-flake-config' is ignored: iets never applies a flake's nixConfig, so a flake that sets extra-substituters or allow-import-from-derivation there runs without them; put the settings in nix.conf ×1
- warn setting 'plugin-files' is ignored: iets loads no plugins ×1
- warn stdenv.isLinux is deprecated, use stdenv.hostPlatform.isLinux instead ×3
- warn stdenv.isDarwin is deprecated, use stdenv.hostPlatform.isDarwin instead ×3
6 failed
| status | attribute | duration |
|---|---|---|
checks.aarch64-darwin.pkgs-hermes-agent
|
1m 41s | |
source: 0 0 0 0 0 0 0 0 0 0 0 0 0 0 0 0 0 …source: 0 0 0 0 0 0 0 0 0 0 0 0 0 0 0 0 0 0 0 0 0 0 0 0 0 0 0 0 0 0 0 0 0 0 0 0 100 5.16M 100 5.16M 0 0 16.13M 0 0 100 5.16M 100 5.16M 0 0 16.12M 0 0 100 5.16M 100 5.16M 0 0 16.12M 0 0 unpacking source archive /nix/var/nix/builds/nix-60931-1014810926/download.tar.gz |
||
checks.aarch64-darwin.pkgs-hermes-desktop
|
1m 53s | |
source: 0 0 0 0 0 0 0 0 0 0 0 0 0 0 0 0 0 …source: 0 0 0 0 0 0 0 0 0 0 0 0 0 0 0 0 0 0 0 0 0 0 0 0 0 0 0 100 4.51M 0 4.51M 0 0 3.43M 0 00:01 4.47M 100 5.16M 0 5.16M 0 0 3.77M 0 00:01 4.47M 100 5.16M 0 5.16M 0 0 3.77M 0 00:01 4.47M 100 5.16M 0 5.16M 0 0 3.77M 0 00:01 4.47M unpacking source archive /nix/var/nix/builds/nix-59779-3194820885/download.tar.gz |
||
checks.aarch64-linux.pkgs-hermes-agent
|
3m 11s | |
source: 0 0 0 0 0 0 0 0 0 0 0 0 0 0 0 0 0 …source: 0 0 0 0 0 0 0 0 0 0 0 0 0 0 0 0 0 0 0 0 0 0 0 0 0 0 0 100 4.00M 0 4.00M 0 0 3.17M 0 00:01 3.94M 100 5.16M 0 5.16M 0 0 3.67M 0 00:01 3.94M 100 5.16M 0 5.16M 0 0 3.67M 0 00:01 3.94M 100 5.16M 0 5.16M 0 0 3.67M 0 00:01 3.94M unpacking source archive /build/download.tar.gz |
||
checks.aarch64-linux.pkgs-hermes-desktop
|
2m 46s | |
source: 0 0 0 0 0 0 0 0 0 0 0 0 0 0 0 0 0 …source: 0 0 0 0 0 0 0 0 0 0 0 0 0 0 0 0 0 0 0 0 0 0 0 0 0 0 0 0 0 0 0 0 0 0 0 0 100 5.16M 100 5.16M 0 0 15.71M 0 0 100 5.16M 100 5.16M 0 0 15.71M 0 0 100 5.16M 100 5.16M 0 0 15.70M 0 0 unpacking source archive /build/download.tar.gz |
||
checks.x86_64-linux.pkgs-hermes-agent
|
1m 26s | |
setup: error: hash mismatch in fixed-output derivation '/nix/store/lb72zp72v8v4crn64nwvhz2s40r2alry-source.drv': specified: sha256-7qt44AFvBkLBWhXO235b …setup: error: hash mismatch in fixed-output derivation '/nix/store/lb72zp72v8v4crn64nwvhz2s40r2alry-source.drv': specified: sha256-7qt44AFvBkLBWhXO235bUxdNYwHYdiizYBmqT/Bs9Lc= got: sha256-f57Y+bp8q3r9OvY6EVgOHNucW4mXip/Cb6ey99JhP/Y= error: build of resolved derivation '/nix/store/lb72zp72v8v4crn64nwvhz2s40r2alry-source.drv' failed error: Cannot build '/nix/store/fqn0qc7h8k10gmvwghrn6nxj4ldn7ixl-nemo-relay-0.10.2-vendor-staging.drv'. Reason: 1 dependency failed. Output paths: /nix/store/i893w7zzgx7j42xdz0d3pg91b8m53qwy-nemo-relay-0.10.2-vendor-staging error: Cannot build '/nix/store/1nfrlips82w5pb3jn2k78c378m4kriqv-nemo-relay-0.10.2-vendor.drv'. Reason: 1 dependency failed. Output paths: /nix/store/7abqp0kxljjl5x2ikz84ig8l1qnydzrh-nemo-relay-0.10.2-vendor error: Cannot build '/nix/store/07pqq9canghkzk1xi68zgdp3ylc2cw8x-python3.14-nemo-relay-0.10.2.drv'. Reason: 2 dependencies failed. Output paths: /nix/store/4qvhllm15n8a0ia4kpl8hgnr1a5b3pah-python3.14-nemo-relay-0.10.2 /nix/store/fhxw4bpgymq4mp39hqy6msxw4pggrkfj-python3.14-nemo-relay-0.10.2-dist error: Cannot build '/nix/store/icymgjvv6kjc610v4sjx8nbk2ky36qf0-python3-3.14.7-env.drv'. Reason: 1 dependency failed. Output paths: /nix/store/k5dw9swfnlblqsdp8p04xgypmdfl4xyh-python3-3.14.7-env error: Cannot build '/nix/store/6017li5m29s8il6yr30gl0y310rmc989-hermes-agent-0.22.2.drv'. Reason: 2 dependencies failed. Output paths: /nix/store/bdizwsi317q92q786rd0a5yq6kbh9345-hermes-agent-0.22.2 /nix/store/xlzw9z9959xjf55n9cw7yiyi5n30s970-hermes-agent-0.22.2-dist error: Cannot build '/nix/store/cbs1sn3i82hppglb2nmr310n5xwmx7dw-check-hermes-agent.drv'. Reason: 1 dependency failed. Output paths: /nix/store/46jmil4v04s0pqz36ck7k0cf5pgxscwl-check-hermes-agent |
||
checks.x86_64-linux.pkgs-hermes-desktop
|
1m 21s | |
setup: error: build of resolved derivation '/nix/store/lb72zp72v8v4crn64nwvhz2s40r2alry-source.drv' failed error: Cannot build '/nix/store/fqn0qc7h8k10gmvwghrn6 …setup: error: build of resolved derivation '/nix/store/lb72zp72v8v4crn64nwvhz2s40r2alry-source.drv' failed error: Cannot build '/nix/store/fqn0qc7h8k10gmvwghrn6nxj4ldn7ixl-nemo-relay-0.10.2-vendor-staging.drv'. Reason: 1 dependency failed. Output paths: /nix/store/i893w7zzgx7j42xdz0d3pg91b8m53qwy-nemo-relay-0.10.2-vendor-staging error: Cannot build '/nix/store/1nfrlips82w5pb3jn2k78c378m4kriqv-nemo-relay-0.10.2-vendor.drv'. Reason: 1 dependency failed. Output paths: /nix/store/7abqp0kxljjl5x2ikz84ig8l1qnydzrh-nemo-relay-0.10.2-vendor error: Cannot build '/nix/store/07pqq9canghkzk1xi68zgdp3ylc2cw8x-python3.14-nemo-relay-0.10.2.drv'. Reason: 2 dependencies failed. Output paths: /nix/store/4qvhllm15n8a0ia4kpl8hgnr1a5b3pah-python3.14-nemo-relay-0.10.2 /nix/store/fhxw4bpgymq4mp39hqy6msxw4pggrkfj-python3.14-nemo-relay-0.10.2-dist error: Cannot build '/nix/store/icymgjvv6kjc610v4sjx8nbk2ky36qf0-python3-3.14.7-env.drv'. Reason: 1 dependency failed. Output paths: /nix/store/k5dw9swfnlblqsdp8p04xgypmdfl4xyh-python3-3.14.7-env error: Cannot build '/nix/store/6017li5m29s8il6yr30gl0y310rmc989-hermes-agent-0.22.2.drv'. Reason: 2 dependencies failed. Output paths: /nix/store/bdizwsi317q92q786rd0a5yq6kbh9345-hermes-agent-0.22.2 /nix/store/xlzw9z9959xjf55n9cw7yiyi5n30s970-hermes-agent-0.22.2-dist error: Cannot build '/nix/store/lpb3ldv6amfw28m70k54201md6rwm8ks-hermes-desktop-0.22.2.drv'. Reason: 1 dependency failed. Output paths: /nix/store/js29wkm0d413wp83bb94v5lcmyks7bzi-hermes-desktop-0.22.2 error: Cannot build '/nix/store/6lh18xxrqg9lhxz6wgirdxsvd44i1cpq-check-hermes-desktop.drv'. Reason: 1 dependency failed. Output paths: /nix/store/pnqllw7n8n35v9s6ylibqzn6x2s3vv69-check-hermes-desktop |
||
13 succeeded
| status | attribute | duration |
|---|---|---|
| loading… | ||
629 already built
| status | attribute | duration |
|---|---|---|
| loading… | ||