numtide/llm-agents.nix build #7723 failed ← #7722 #7724 →
eval warnings
4 kinds
· 8 occurrences
- warn setting 'accept-flake-config' is ignored: iets never applies a flake's nixConfig, so a flake that sets extra-substituters or allow-import-from-derivation there runs without them; put the settings in nix.conf ×1
- warn setting 'plugin-files' is ignored: iets loads no plugins ×1
- warn stdenv.isLinux is deprecated, use stdenv.hostPlatform.isLinux instead ×3
- warn stdenv.isDarwin is deprecated, use stdenv.hostPlatform.isDarwin instead ×3
6 failed
| status | attribute | duration |
|---|---|---|
checks.aarch64-darwin.pkgs-hermes-agent
|
1m 22s | |
source: 0 0 0 0 0 0 0 0 0 0 0 0 0 0 0 0 0 …source: 0 0 0 0 0 0 0 0 0 0 0 0 0 0 0 0 0 0 0 0 0 0 0 0 0 0 0 0 0 0 0 0 0 0 0 0 100 5.16M 0 5.16M 0 0 5.36M 0 0 100 5.16M 0 5.16M 0 0 5.35M 0 0 100 5.16M 0 5.16M 0 0 5.35M 0 0 unpacking source archive /nix/var/nix/builds/nix-23190-2751419909/download.tar.gz |
||
checks.aarch64-darwin.pkgs-hermes-desktop
|
1m 22s | |
source: 0 0 0 0 0 0 0 0 0 0 0 0 0 0 0 0 0 …source: 0 0 0 0 0 0 0 0 0 0 0 0 0 0 0 0 0 0 0 0 0 0 0 0 0 0 0 0 0 0 0 0 0 0 0 0 100 5.16M 0 5.16M 0 0 4.57M 0 00:01 0 100 5.16M 0 5.16M 0 0 4.57M 0 00:01 0 100 5.16M 0 5.16M 0 0 4.57M 0 00:01 0 unpacking source archive /nix/var/nix/builds/nix-22793-2057926048/download.tar.gz |
||
checks.aarch64-linux.pkgs-hermes-agent
|
2m 1s | |
source: 0 0 0 0 0 0 0 0 0 0 0 0 0 0 0 0 0 …source: 0 0 0 0 0 0 0 0 0 0 0 0 0 0 0 0 0 0 0 0 0 0 0 0 0 0 0 0 0 0 0 0 0 0 0 0 100 5.16M 100 5.16M 0 0 10.45M 0 0 100 5.16M 100 5.16M 0 0 10.45M 0 0 100 5.16M 100 5.16M 0 0 10.45M 0 0 unpacking source archive /build/download.tar.gz |
||
checks.aarch64-linux.pkgs-hermes-desktop
|
2m 3s | |
source: 0 0 0 0 0 0 0 0 0 0 0 0 0 0 0 0 0 …source: 0 0 0 0 0 0 0 0 0 0 0 0 0 0 0 0 0 0 0 0 0 0 0 0 0 0 0 0 0 0 0 0 0 0 0 0 100 5.16M 100 5.16M 0 0 15.08M 0 0 100 5.16M 100 5.16M 0 0 15.08M 0 0 100 5.16M 100 5.16M 0 0 15.08M 0 0 unpacking source archive /build/download.tar.gz |
||
checks.x86_64-linux.pkgs-hermes-agent
|
1m 27s | |
setup: error: hash mismatch in fixed-output derivation '/nix/store/lb72zp72v8v4crn64nwvhz2s40r2alry-source.drv': specified: sha256-7qt44AFvBkLBWhXO235b …setup: error: hash mismatch in fixed-output derivation '/nix/store/lb72zp72v8v4crn64nwvhz2s40r2alry-source.drv': specified: sha256-7qt44AFvBkLBWhXO235bUxdNYwHYdiizYBmqT/Bs9Lc= got: sha256-f57Y+bp8q3r9OvY6EVgOHNucW4mXip/Cb6ey99JhP/Y= error: build of resolved derivation '/nix/store/lb72zp72v8v4crn64nwvhz2s40r2alry-source.drv' failed error: Cannot build '/nix/store/fqn0qc7h8k10gmvwghrn6nxj4ldn7ixl-nemo-relay-0.10.2-vendor-staging.drv'. Reason: 1 dependency failed. Output paths: /nix/store/i893w7zzgx7j42xdz0d3pg91b8m53qwy-nemo-relay-0.10.2-vendor-staging error: Cannot build '/nix/store/1nfrlips82w5pb3jn2k78c378m4kriqv-nemo-relay-0.10.2-vendor.drv'. Reason: 1 dependency failed. Output paths: /nix/store/7abqp0kxljjl5x2ikz84ig8l1qnydzrh-nemo-relay-0.10.2-vendor error: Cannot build '/nix/store/07pqq9canghkzk1xi68zgdp3ylc2cw8x-python3.14-nemo-relay-0.10.2.drv'. Reason: 2 dependencies failed. Output paths: /nix/store/4qvhllm15n8a0ia4kpl8hgnr1a5b3pah-python3.14-nemo-relay-0.10.2 /nix/store/fhxw4bpgymq4mp39hqy6msxw4pggrkfj-python3.14-nemo-relay-0.10.2-dist error: Cannot build '/nix/store/icymgjvv6kjc610v4sjx8nbk2ky36qf0-python3-3.14.7-env.drv'. Reason: 1 dependency failed. Output paths: /nix/store/k5dw9swfnlblqsdp8p04xgypmdfl4xyh-python3-3.14.7-env error: Cannot build '/nix/store/npd5ckx54fsqkpanlqpgwkcmidkgnq6v-hermes-agent-0.22.1.drv'. Reason: 2 dependencies failed. Output paths: /nix/store/5w4xx71ldqll03vrqaxjx5p6smakmi07-hermes-agent-0.22.1-dist /nix/store/mkx1giylwcy1rihngg4x8wpa04j9fkjn-hermes-agent-0.22.1 error: Cannot build '/nix/store/79lnzbnfy90xd6njfd31369hlndb5al4-check-hermes-agent.drv'. Reason: 1 dependency failed. Output paths: /nix/store/h164ip4k95vpczqzk2pashd1nanhyvcc-check-hermes-agent |
||
checks.x86_64-linux.pkgs-hermes-desktop
|
1m 25s | |
setup: error: build of resolved derivation '/nix/store/lb72zp72v8v4crn64nwvhz2s40r2alry-source.drv' failed error: Cannot build '/nix/store/fqn0qc7h8k10gmvwghrn6 …setup: error: build of resolved derivation '/nix/store/lb72zp72v8v4crn64nwvhz2s40r2alry-source.drv' failed error: Cannot build '/nix/store/fqn0qc7h8k10gmvwghrn6nxj4ldn7ixl-nemo-relay-0.10.2-vendor-staging.drv'. Reason: 1 dependency failed. Output paths: /nix/store/i893w7zzgx7j42xdz0d3pg91b8m53qwy-nemo-relay-0.10.2-vendor-staging error: Cannot build '/nix/store/1nfrlips82w5pb3jn2k78c378m4kriqv-nemo-relay-0.10.2-vendor.drv'. Reason: 1 dependency failed. Output paths: /nix/store/7abqp0kxljjl5x2ikz84ig8l1qnydzrh-nemo-relay-0.10.2-vendor error: Cannot build '/nix/store/07pqq9canghkzk1xi68zgdp3ylc2cw8x-python3.14-nemo-relay-0.10.2.drv'. Reason: 2 dependencies failed. Output paths: /nix/store/4qvhllm15n8a0ia4kpl8hgnr1a5b3pah-python3.14-nemo-relay-0.10.2 /nix/store/fhxw4bpgymq4mp39hqy6msxw4pggrkfj-python3.14-nemo-relay-0.10.2-dist error: Cannot build '/nix/store/icymgjvv6kjc610v4sjx8nbk2ky36qf0-python3-3.14.7-env.drv'. Reason: 1 dependency failed. Output paths: /nix/store/k5dw9swfnlblqsdp8p04xgypmdfl4xyh-python3-3.14.7-env error: Cannot build '/nix/store/npd5ckx54fsqkpanlqpgwkcmidkgnq6v-hermes-agent-0.22.1.drv'. Reason: 2 dependencies failed. Output paths: /nix/store/5w4xx71ldqll03vrqaxjx5p6smakmi07-hermes-agent-0.22.1-dist /nix/store/mkx1giylwcy1rihngg4x8wpa04j9fkjn-hermes-agent-0.22.1 error: Cannot build '/nix/store/na86d10w235rx0znpjzn6gvpxw6gd68i-hermes-desktop-0.22.1.drv'. Reason: 1 dependency failed. Output paths: /nix/store/4aviak6yyi75v9yx6hycc4vfmy6ci5hf-hermes-desktop-0.22.1 error: Cannot build '/nix/store/v42ydp07i5sh7c3xmw3a2vvy27glv3h5-check-hermes-desktop.drv'. Reason: 1 dependency failed. Output paths: /nix/store/5axlw10gf50wq8d0hpsr1w448r4301s7-check-hermes-desktop |
||
13 succeeded
| status | attribute | duration |
|---|---|---|
| loading… | ||
623 already built
| status | attribute | duration |
|---|---|---|
| loading… | ||