numtide/llm-agents.nix build #7675 failed ← #7674 #7676 →
eval warnings
4 kinds
· 8 occurrences
- warn setting 'accept-flake-config' is ignored: iets never applies a flake's nixConfig, so a flake that sets extra-substituters or allow-import-from-derivation there runs without them; put the settings in nix.conf ×1
- warn setting 'plugin-files' is ignored: iets loads no plugins ×1
- warn stdenv.isLinux is deprecated, use stdenv.hostPlatform.isLinux instead ×3
- warn stdenv.isDarwin is deprecated, use stdenv.hostPlatform.isDarwin instead ×3
6 failed
| status | attribute | duration |
|---|---|---|
checks.aarch64-darwin.pkgs-hermes-agent
|
13s | |
source: 0 0 0 0 0 0 0 0 0 0 0 0 0 0 0 0 0 …source: 0 0 0 0 0 0 0 0 0 0 0 0 0 0 0 0 0 0 0 0 0 0 0 0 0 0 0 0 0 0 0 0 0 0 0 0 100 5.16M 100 5.16M 0 0 17.28M 0 0 100 5.16M 100 5.16M 0 0 17.27M 0 0 100 5.16M 100 5.16M 0 0 17.27M 0 0 unpacking source archive /nix/var/nix/builds/nix-58646-2573541799/download.tar.gz |
||
checks.aarch64-darwin.pkgs-hermes-desktop
|
10s | |
source: 0 0 0 0 0 0 0 0 0 0 0 0 0 0 0 0 0 …source: 0 0 0 0 0 0 0 0 0 0 0 0 0 0 0 0 0 0 0 0 0 0 0 0 0 0 0 0 0 0 0 0 0 0 0 0 100 5.16M 0 5.16M 0 0 4.10M 0 00:01 0 100 5.16M 0 5.16M 0 0 4.10M 0 00:01 0 100 5.16M 0 5.16M 0 0 4.10M 0 00:01 0 unpacking source archive /nix/var/nix/builds/nix-57027-1753084020/download.tar.gz |
||
checks.aarch64-linux.pkgs-hermes-agent
|
47s | |
source: 0 0 0 0 0 0 0 0 0 0 0 0 0 0 0 0 0 …source: 0 0 0 0 0 0 0 0 0 0 0 0 0 0 0 0 0 0 0 0 0 0 0 0 0 0 0 0 0 0 0 0 0 0 0 0 100 5.16M 100 5.16M 0 0 9.90M 0 0 100 5.16M 100 5.16M 0 0 9.90M 0 0 100 5.16M 100 5.16M 0 0 9.90M 0 0 unpacking source archive /build/download.tar.gz |
||
checks.aarch64-linux.pkgs-hermes-desktop
|
1m 15s | |
source: 0 0 0 0 0 0 0 0 0 0 0 0 0 0 0 0 0 …source: 0 0 0 0 0 0 0 0 0 0 0 0 0 0 0 0 0 0 0 0 0 0 0 0 0 0 0 0 0 0 0 0 0 0 0 0 100 5.16M 100 5.16M 0 0 6.45M 0 0 100 5.16M 100 5.16M 0 0 6.45M 0 0 100 5.16M 100 5.16M 0 0 6.45M 0 0 unpacking source archive /build/download.tar.gz |
||
checks.x86_64-linux.pkgs-hermes-agent
|
39s | |
setup: error: hash mismatch in fixed-output derivation '/nix/store/lb72zp72v8v4crn64nwvhz2s40r2alry-source.drv': specified: sha256-7qt44AFvBkLBWhXO235b …setup: error: hash mismatch in fixed-output derivation '/nix/store/lb72zp72v8v4crn64nwvhz2s40r2alry-source.drv': specified: sha256-7qt44AFvBkLBWhXO235bUxdNYwHYdiizYBmqT/Bs9Lc= got: sha256-f57Y+bp8q3r9OvY6EVgOHNucW4mXip/Cb6ey99JhP/Y= error: build of resolved derivation '/nix/store/lb72zp72v8v4crn64nwvhz2s40r2alry-source.drv' failed error: Cannot build '/nix/store/fqn0qc7h8k10gmvwghrn6nxj4ldn7ixl-nemo-relay-0.10.2-vendor-staging.drv'. Reason: 1 dependency failed. Output paths: /nix/store/i893w7zzgx7j42xdz0d3pg91b8m53qwy-nemo-relay-0.10.2-vendor-staging error: Cannot build '/nix/store/1nfrlips82w5pb3jn2k78c378m4kriqv-nemo-relay-0.10.2-vendor.drv'. Reason: 1 dependency failed. Output paths: /nix/store/7abqp0kxljjl5x2ikz84ig8l1qnydzrh-nemo-relay-0.10.2-vendor error: Cannot build '/nix/store/07pqq9canghkzk1xi68zgdp3ylc2cw8x-python3.14-nemo-relay-0.10.2.drv'. Reason: 2 dependencies failed. Output paths: /nix/store/4qvhllm15n8a0ia4kpl8hgnr1a5b3pah-python3.14-nemo-relay-0.10.2 /nix/store/fhxw4bpgymq4mp39hqy6msxw4pggrkfj-python3.14-nemo-relay-0.10.2-dist error: Cannot build '/nix/store/yl6cfnbvcnnwmhlqbnqw61j2hllk2y1d-python3-3.14.7-env.drv'. Reason: 1 dependency failed. Output paths: /nix/store/s5cf6r6qhnzv12n3pbzyaxgqbq4c29cr-python3-3.14.7-env error: Cannot build '/nix/store/jyaclr3jdb78mlqfsm9i677hznln78r8-hermes-agent-0.22.0.drv'. Reason: 2 dependencies failed. Output paths: /nix/store/v4z2w7ih8ahisfq85pjqbxgrnph3za02-hermes-agent-0.22.0 /nix/store/zyrs9aapa8mrygific410185j0ynlmdj-hermes-agent-0.22.0-dist error: Cannot build '/nix/store/8kxyflxp7gv28vnmy0596x37v39zgsfb-check-hermes-agent.drv'. Reason: 1 dependency failed. Output paths: /nix/store/wpigvzc9in1lyqc2ah9dynaxdsgv0m3i-check-hermes-agent |
||
checks.x86_64-linux.pkgs-hermes-desktop
|
7s | |
setup: error: build of resolved derivation '/nix/store/lb72zp72v8v4crn64nwvhz2s40r2alry-source.drv' failed error: Cannot build '/nix/store/fqn0qc7h8k10gmvwghrn6 …setup: error: build of resolved derivation '/nix/store/lb72zp72v8v4crn64nwvhz2s40r2alry-source.drv' failed error: Cannot build '/nix/store/fqn0qc7h8k10gmvwghrn6nxj4ldn7ixl-nemo-relay-0.10.2-vendor-staging.drv'. Reason: 1 dependency failed. Output paths: /nix/store/i893w7zzgx7j42xdz0d3pg91b8m53qwy-nemo-relay-0.10.2-vendor-staging error: Cannot build '/nix/store/1nfrlips82w5pb3jn2k78c378m4kriqv-nemo-relay-0.10.2-vendor.drv'. Reason: 1 dependency failed. Output paths: /nix/store/7abqp0kxljjl5x2ikz84ig8l1qnydzrh-nemo-relay-0.10.2-vendor error: Cannot build '/nix/store/07pqq9canghkzk1xi68zgdp3ylc2cw8x-python3.14-nemo-relay-0.10.2.drv'. Reason: 2 dependencies failed. Output paths: /nix/store/4qvhllm15n8a0ia4kpl8hgnr1a5b3pah-python3.14-nemo-relay-0.10.2 /nix/store/fhxw4bpgymq4mp39hqy6msxw4pggrkfj-python3.14-nemo-relay-0.10.2-dist error: Cannot build '/nix/store/yl6cfnbvcnnwmhlqbnqw61j2hllk2y1d-python3-3.14.7-env.drv'. Reason: 1 dependency failed. Output paths: /nix/store/s5cf6r6qhnzv12n3pbzyaxgqbq4c29cr-python3-3.14.7-env error: Cannot build '/nix/store/jyaclr3jdb78mlqfsm9i677hznln78r8-hermes-agent-0.22.0.drv'. Reason: 2 dependencies failed. Output paths: /nix/store/v4z2w7ih8ahisfq85pjqbxgrnph3za02-hermes-agent-0.22.0 /nix/store/zyrs9aapa8mrygific410185j0ynlmdj-hermes-agent-0.22.0-dist error: Cannot build '/nix/store/whywhzb2fmkvkiafsffri5hq1xyscp9s-hermes-desktop-0.22.0.drv'. Reason: 1 dependency failed. Output paths: /nix/store/3nhxhyld7v0apcq4a11gj4g5qn9bb5vv-hermes-desktop-0.22.0 error: Cannot build '/nix/store/x0f3dcrmqp8k1h12zxjq7lxbpk6bmma2-check-hermes-desktop.drv'. Reason: 1 dependency failed. Output paths: /nix/store/ybixjg2yv7a45g909hcjdk7czvxdhyba-check-hermes-desktop |
||
12 succeeded
| status | attribute | duration |
|---|---|---|
| loading… | ||
624 already built
| status | attribute | duration |
|---|---|---|
| loading… | ||