setup
checks.x86_64-linux.pkgs-aven
· build #7557
· raw
1these 5 derivations will be built:2 /nix/store/714llznx715g9l9y7c88ic9h1wnywp7c-source.drv3 /nix/store/jqi9igx60mv4wxapryjn1lg4sdmblp1g-aven-0.1.49-vendor-staging.drv4 /nix/store/ig1p537vyzvpv96d4h587qpanrmbyzc9-aven-0.1.49-vendor.drv5 /nix/store/m174dg79csmcg60y2x1w0yr99b47lhqd-aven-0.1.49.drv6 /nix/store/mwjk14g29gn344skl0w69z9xjcf05li0-check-aven.drv7error: Cannot build '/nix/store/m174dg79csmcg60y2x1w0yr99b47lhqd-aven-0.1.49.drv'.8 Reason: builder failed with exit code 101.9 Output paths:10 /nix/store/33dsl168gwyz7n3rq02wsgwb68v5h4gb-aven-0.1.4911 Last 25 log lines:12 > test update::install::tests::checksum_requires_hash_and_expected_filename ... ok13 > test update::install::tests::direct_install_downloads_validates_and_replaces_exact_bytes ... ok14 > test update::install::tests::direct_install_rejections_preserve_existing_binary ... ok15 > test update::install::tests::extraction_accepts_only_one_root_binary ... ok16 > test update::release::tests::parses_release_and_strips_v_for_semver ... ok17 > test update::release::tests::rejects_malformed_version_and_missing_or_duplicate_assets ... ok18 > test update::release::tests::rejects_non_github_asset_urls ... ok19 > test update::tests::cancellation_is_reported ... ok20 > test update::tests::package_version_is_semver ... ok21 >22 > failures:23 >24 > ---- encrypted_tail_http::tests::membership::management::second_stale_race_stops_and_next_round_resolves_before_fresh_candidate stdout ----25 >26 > thread 'encrypted_tail_http::tests::membership::management::second_stale_race_stops_and_next_round_resolves_before_fresh_candidate' (27813) panicked at src/encrypted_tail_http/tests/membership/management.rs:639:10:27 > called `Result::unwrap()` on an `Err` value: error enrollment-network outcome-unknown28 > note: run with `RUST_BACKTRACE=1` environment variable to display a backtrace29 >30 >31 > failures:32 > encrypted_tail_http::tests::membership::management::second_stale_race_stops_and_next_round_resolves_before_fresh_candidate33 >34 > test result: FAILED. 2319 passed; 1 failed; 19 ignored; 0 measured; 20 filtered out; finished in 672.33s35 >36 > error: test failed, to rerun pass `--lib`37 For full logs, run:38 nix log /nix/store/m174dg79csmcg60y2x1w0yr99b47lhqd-aven-0.1.49.drv39error: Cannot build '/nix/store/mwjk14g29gn344skl0w69z9xjcf05li0-check-aven.drv'.40 Reason: 1 dependency failed.41 Output paths:42 /nix/store/c16g4hyk1jyji7lm3cv1j37fygms4mzs-check-aven