nixbot

builds

numtide/llm-agents.nix build #7462 failed

branch main · PR #10256 · commit 79ec5913c7 · · took 41m 49s · eval 11s

eval warnings 4 kinds · 8 occurrences
  • warn setting 'accept-flake-config' is ignored: iets never applies a flake's nixConfig, so a flake that sets extra-substituters or allow-import-from-derivation there runs without them; put the settings in nix.conf ×1
  • warn setting 'plugin-files' is ignored: iets loads no plugins ×1
  • warn stdenv.isLinux is deprecated, use stdenv.hostPlatform.isLinux instead ×3
  • warn stdenv.isDarwin is deprecated, use stdenv.hostPlatform.isDarwin instead ×3

2 failed
failed attributes
status attribute duration
failed checks.aarch64-darwin.pkgs-clauth 21m 11s
clauth-0.17.0: thread 'daemon::gateway::tests::a_gateway_below_the_floor_is_stopped_and_held_until_its_binary_changes' (16240008) panicked at src/daemon/../../t …
clauth-0.17.0:
thread 'daemon::gateway::tests::a_gateway_below_the_floor_is_stopped_and_held_until_its_binary_changes' (16240008) panicked at src/daemon/../../tests/inline/daemon_gateway.rs:927:5:
assertion `left == right` failed: a changed binary gets a fresh start
  left: 1
 right: 2
failures:
    daemon::gateway::tests::a_gateway_below_the_floor_is_stopped_and_held_until_its_binary_changes
test result: FAILED. 4850 passed; 1 failed; 11 ignored; 0 measured; 27 filtered out; finished in 817.14s
error: test failed, to rerun pass `--bin clauth`
failed checks.aarch64-linux.pkgs-clauth 41m 38s
clauth-0.17.0: assertion `left == right` failed left: Idle right: Rotated note: run with `RUST_BACKTRACE=1` environment variable to display a backtrace failu …
clauth-0.17.0:
assertion `left == right` failed
  left: Idle
 right: Rotated
note: run with `RUST_BACKTRACE=1` environment variable to display a backtrace
failures:
    codex_auth::tests::the_standby_pass_walks_its_decision_table
test result: FAILED. 4809 passed; 1 failed; 1 ignored; 0 measured; 27 filtered out; finished in 760.64s
error: test failed, to rerun pass `--bin clauth`
14 succeeded
succeeded attributes
status attribute duration
loading…
621 already built
skipped attributes
status attribute duration
loading…