setup
checks.aarch64-linux.pkgs-clauth
· build #7372
· raw
1these 3 derivations will be built:2 /nix/store/b4x6f0gl5zyldk60fa0y6hvb64mn2yx8-clauth-0.17.0-vendor.drv3 /nix/store/s52kmn7nrhii2bijjxjkkhr5jzzqqff0-clauth-0.17.0.drv4 /nix/store/khp4vz8pw1hlhj4c70k21lc37dsd0g6n-check-clauth.drv5these 2 paths will be fetched (574.8 KiB download, 610.3 KiB unpacked):6 /nix/store/z9lrz9xrmsxml967fz3ihswl0mvzn7ld-procps-4.0.7-man7 /nix/store/i67647rrpjz4c1rkb9gl2h7cr2k0yrn2-ps-procps-4.0.78error: build of '/nix/store/s52kmn7nrhii2bijjxjkkhr5jzzqqff0-clauth-0.17.0.drv' on 'grpc://farm.numtide.com:50051?client-cert=/run/secrets/vars/per-machine/bld1/nix-farm-ci/crt&client-key=/run/secrets/vars/per-machine/bld1/nix-farm-ci/key&connect-timeout=20&system=aarch64-linux' failed: Cannot build '/nix/store/s52kmn7nrhii2bijjxjkkhr5jzzqqff0-clauth-0.17.0.drv'.9 Reason: builder failed with exit code 101.10 Output paths:11 /nix/store/sygziywafwv87568rrfgslvxn7f4ybsz-clauth-0.17.012 Last 25 log lines:13 > assertion `left == right` failed14 > left: 015 > right: 116 >17 > ---- daemon::api::tests::pipelined_requests_are_answered_in_order stdout ----18 >19 > thread 'daemon::api::tests::pipelined_requests_are_answered_in_order' (6774) panicked at src/daemon/api/../../../tests/inline/daemon_api_server.rs:559:54:20 > fixture: "openssl failed to generate a named-curve key"21 >22 > ---- tui::render::global_config::tests::context_nudge_edit_line_marks_invalid_buffer_danger stdout ----23 >24 > thread 'tui::render::global_config::tests::context_nudge_edit_line_marks_invalid_buffer_danger' (15731) panicked at src/tui/render/../../../tests/inline/tui_render_global_config.rs:594:5:25 > assertion `left == right` failed: Style::new().fg(Color::Rgb(243, 139, 168)).bg(Color::Rgb(17, 17, 27))26 > left: Some(Rgb(243, 139, 168))27 > right: Some(Indexed(211))28 >29 >30 > failures:31 > daemon::api::routes::tests::an_unreadable_device_list_refuses_every_request32 > daemon::api::tests::pipelined_requests_are_answered_in_order33 > tui::render::global_config::tests::context_nudge_edit_line_marks_invalid_buffer_danger34 >35 > test result: FAILED. 4811 passed; 3 failed; 1 ignored; 0 measured; 23 filtered out; finished in 753.73s36 >37 > error: test failed, to rerun pass `--bin clauth`38 For full logs, run:39 nix log /nix/store/s52kmn7nrhii2bijjxjkkhr5jzzqqff0-clauth-0.17.0.drv40error: Cannot build '/nix/store/s52kmn7nrhii2bijjxjkkhr5jzzqqff0-clauth-0.17.0.drv'.41 Reason: builder failed with exit code 1.42 Output paths:43 /nix/store/sygziywafwv87568rrfgslvxn7f4ybsz-clauth-0.17.044error: Cannot build '/nix/store/khp4vz8pw1hlhj4c70k21lc37dsd0g6n-check-clauth.drv'.45 Reason: 1 dependency failed.46 Output paths:47 /nix/store/dkcjgc4rfkqprnri34qzxm6gnhamgprc-check-clauth