nixbot

builds

numtide/llm-agents.nix build #7323 failed

branch main · PR #10418 · commit a66c600ac4 · · took 1m 52s · eval 9s

eval warnings 4 kinds · 8 occurrences
  • warn setting 'accept-flake-config' is ignored: iets never applies a flake's nixConfig, so a flake that sets extra-substituters or allow-import-from-derivation there runs without them; put the settings in nix.conf ×1
  • warn setting 'plugin-files' is ignored: iets loads no plugins ×1
  • warn stdenv.isLinux is deprecated, use stdenv.hostPlatform.isLinux instead ×3
  • warn stdenv.isDarwin is deprecated, use stdenv.hostPlatform.isDarwin instead ×3

3 failed
failed attributes
status attribute duration
failed checks.aarch64-darwin.pkgs-mcptoon 1m 40s
mcptoon-0.8.18: self._warn_or_fail_if_strict(f"Unknown config option: {key}\n") ../../../../../store/gc3636lzigd9yjiv4yqadw95l57cd4la-python3.14-pytest-9.1. …
mcptoon-0.8.18:
    self._warn_or_fail_if_strict(f"Unknown config option: {key}\n")
../../../../../store/gc3636lzigd9yjiv4yqadw95l57cd4la-python3.14-pytest-9.1.1/lib/python3.14/site-packages/_pytest/config/__init__.py:1464
  /nix/store/gc3636lzigd9yjiv4yqadw95l57cd4la-python3.14-pytest-9.1.1/lib/python3.14/site-packages/_pytest/config/__init__.py:1464: PytestConfigWarning: Unknown config option: timeout_method
    self._warn_or_fail_if_strict(f"Unknown config option: {key}\n")
-- Docs: https://docs.pytest.org/en/stable/how-to/capture-warnings.html
=========================== short test summary info ============================
FAILED tests/test_discover.py::TestPreferInstalledRunners::test_a_module_without_main_is_not_runnable - AssertionError: assert ['/nix/store/4l8r0s2r5fna7src82b5fc2hixdvfyw0-python...
= 1 failed, 2060 passed, 13 skipped, 4 deselected, 2 warnings in 95.82s (0:01:35) =
failed checks.aarch64-linux.pkgs-mcptoon 1m 37s
mcptoon-0.8.18: self._warn_or_fail_if_strict(f"Unknown config option: {key}\n") ../../nix/store/1h3wrwjnlyqi6q0xr11f27awl028mih2-python3.14-pytest-9.1.1/lib …
mcptoon-0.8.18:
    self._warn_or_fail_if_strict(f"Unknown config option: {key}\n")
../../nix/store/1h3wrwjnlyqi6q0xr11f27awl028mih2-python3.14-pytest-9.1.1/lib/python3.14/site-packages/_pytest/config/__init__.py:1464
  /nix/store/1h3wrwjnlyqi6q0xr11f27awl028mih2-python3.14-pytest-9.1.1/lib/python3.14/site-packages/_pytest/config/__init__.py:1464: PytestConfigWarning: Unknown config option: timeout_method
    self._warn_or_fail_if_strict(f"Unknown config option: {key}\n")
-- Docs: https://docs.pytest.org/en/stable/how-to/capture-warnings.html
=========================== short test summary info ============================
FAILED tests/test_discover.py::TestPreferInstalledRunners::test_a_module_without_main_is_not_runnable - AssertionError: assert ['/nix/store/3fl7bdkdxk2k4nssy1d1161isbzn6bsr-python...
= 1 failed, 2061 passed, 12 skipped, 4 deselected, 2 warnings in 85.71s (0:01:25) =
failed checks.x86_64-linux.pkgs-mcptoon 1m 25s
mcptoon-0.8.18: self._warn_or_fail_if_strict(f"Unknown config option: {key}\n") ../../nix/store/fwqp3f54vqakq82lfrpiw908xi1iln0w-python3.14-pytest-9.1.1/lib …
mcptoon-0.8.18:
    self._warn_or_fail_if_strict(f"Unknown config option: {key}\n")
../../nix/store/fwqp3f54vqakq82lfrpiw908xi1iln0w-python3.14-pytest-9.1.1/lib/python3.14/site-packages/_pytest/config/__init__.py:1464
  /nix/store/fwqp3f54vqakq82lfrpiw908xi1iln0w-python3.14-pytest-9.1.1/lib/python3.14/site-packages/_pytest/config/__init__.py:1464: PytestConfigWarning: Unknown config option: timeout_method
    self._warn_or_fail_if_strict(f"Unknown config option: {key}\n")
-- Docs: https://docs.pytest.org/en/stable/how-to/capture-warnings.html
=========================== short test summary info ============================
FAILED tests/test_discover.py::TestPreferInstalledRunners::test_a_module_without_main_is_not_runnable - AssertionError: assert ['/nix/store/d64q19q1xjdwfhqx6czvrjgrhq0n3lcc-python...
= 1 failed, 2061 passed, 12 skipped, 4 deselected, 2 warnings in 81.29s (0:01:21) =
13 succeeded
succeeded attributes
status attribute duration
loading…
605 already built
skipped attributes
status attribute duration
loading…