setup
checks.x86_64-linux.pkgs-mcptoon
· build #7288
· raw
1these 3 derivations will be built:2 /nix/store/l20s8hhnijy2ff3q7kirxkjsai85j5vl-source.drv3 /nix/store/cibzm0m7afaf4lvvh5n4ipc9pm5jw9dy-mcptoon-0.8.18.drv4 /nix/store/wwmvakq8qjvwqc461si3yvibdpbisipx-check-mcptoon.drv5error: Cannot build '/nix/store/cibzm0m7afaf4lvvh5n4ipc9pm5jw9dy-mcptoon-0.8.18.drv'.6 Reason: builder failed with exit code 1.7 Output paths:8 /nix/store/6qb6m496l1d7fpms2bx6fg6lrxvfbmkn-mcptoon-0.8.189 /nix/store/m2rvr8g2wmi55dxb8di6awpb42ampir3-mcptoon-0.8.18-dist10 Last 25 log lines:11 > Pin the real function (not a mock) against a stdlib module that is12 > importable everywhere — this is the check that keeps a bare13 > `find_spec(module)` from writing a dead server entry.14 > """15 > > assert discover_mod._resolve_local_module("json") is None16 > E AssertionError: assert ['/nix/store/d64q19q1xjdwfhqx6czvrjgrhq0n3lcc-python3-3.14.7/bin/python3.14', '-m', 'json'] is None17 > E + where ['/nix/store/d64q19q1xjdwfhqx6czvrjgrhq0n3lcc-python3-3.14.7/bin/python3.14', '-m', 'json'] = <function _resolve_local_module at 0x7ffff5213a00>('json')18 > E + where <function _resolve_local_module at 0x7ffff5213a00> = discover_mod._resolve_local_module19 >20 > tests/test_discover.py:472: AssertionError21 > =============================== warnings summary ===============================22 > ../../nix/store/fwqp3f54vqakq82lfrpiw908xi1iln0w-python3.14-pytest-9.1.1/lib/python3.14/site-packages/_pytest/config/__init__.py:146423 > /nix/store/fwqp3f54vqakq82lfrpiw908xi1iln0w-python3.14-pytest-9.1.1/lib/python3.14/site-packages/_pytest/config/__init__.py:1464: PytestConfigWarning: Unknown config option: timeout24 >25 > self._warn_or_fail_if_strict(f"Unknown config option: {key}\n")26 >27 > ../../nix/store/fwqp3f54vqakq82lfrpiw908xi1iln0w-python3.14-pytest-9.1.1/lib/python3.14/site-packages/_pytest/config/__init__.py:146428 > /nix/store/fwqp3f54vqakq82lfrpiw908xi1iln0w-python3.14-pytest-9.1.1/lib/python3.14/site-packages/_pytest/config/__init__.py:1464: PytestConfigWarning: Unknown config option: timeout_method29 >30 > self._warn_or_fail_if_strict(f"Unknown config option: {key}\n")31 >32 > -- Docs: https://docs.pytest.org/en/stable/how-to/capture-warnings.html33 > =========================== short test summary info ============================34 > FAILED tests/test_discover.py::TestPreferInstalledRunners::test_a_module_without_main_is_not_runnable - AssertionError: assert ['/nix/store/d64q19q1xjdwfhqx6czvrjgrhq0n3lcc-python...35 > = 1 failed, 2061 passed, 12 skipped, 4 deselected, 2 warnings in 80.12s (0:01:20) =36 For full logs, run:37 nix log /nix/store/cibzm0m7afaf4lvvh5n4ipc9pm5jw9dy-mcptoon-0.8.18.drv38error: Cannot build '/nix/store/wwmvakq8qjvwqc461si3yvibdpbisipx-check-mcptoon.drv'.39 Reason: 1 dependency failed.40 Output paths:41 /nix/store/rhy08yy8hwq0rkazkcw6npyrc82ma462-check-mcptoon