setup
checks.aarch64-darwin.pkgs-mcptoon
· build #7288
· raw
1these 2 derivations will be built:2 /nix/store/yrp8v9awgccv8p9p8gq2wh1r8qjnl559-mcptoon-0.8.18.drv3 /nix/store/nkymp04gm26bn713aiszw49n2qmvnnbg-check-mcptoon.drv4error: build of '/nix/store/yrp8v9awgccv8p9p8gq2wh1r8qjnl559-mcptoon-0.8.18.drv' on 'grpc://farm.numtide.com:50051?client-cert=/run/secrets/vars/per-machine/bld1/nix-farm-ci/crt&client-key=/run/secrets/vars/per-machine/bld1/nix-farm-ci/key&connect-timeout=20&system=aarch64-darwin' failed: Cannot build '/nix/store/yrp8v9awgccv8p9p8gq2wh1r8qjnl559-mcptoon-0.8.18.drv'.5 Reason: builder failed with exit code 1.6 Output paths:7 /nix/store/hsz8k38mdckb435iymmgy79x1c6ha3nz-mcptoon-0.8.188 /nix/store/mhsfk552l0l0ybyannw666rkahdkm4bj-mcptoon-0.8.18-dist9 Last 25 log lines:10 > Pin the real function (not a mock) against a stdlib module that is11 > importable everywhere — this is the check that keeps a bare12 > `find_spec(module)` from writing a dead server entry.13 > """14 > > assert discover_mod._resolve_local_module("json") is None15 > E AssertionError: assert ['/nix/store/4l8r0s2r5fna7src82b5fc2hixdvfyw0-python3-3.14.7/bin/python3.14', '-m', 'json'] is None16 > E + where ['/nix/store/4l8r0s2r5fna7src82b5fc2hixdvfyw0-python3-3.14.7/bin/python3.14', '-m', 'json'] = <function _resolve_local_module at 0x10b3eecf0>('json')17 > E + where <function _resolve_local_module at 0x10b3eecf0> = discover_mod._resolve_local_module18 >19 > tests/test_discover.py:472: AssertionError20 > =============================== warnings summary ===============================21 > ../../../../../store/gc3636lzigd9yjiv4yqadw95l57cd4la-python3.14-pytest-9.1.1/lib/python3.14/site-packages/_pytest/config/__init__.py:146422 > /nix/store/gc3636lzigd9yjiv4yqadw95l57cd4la-python3.14-pytest-9.1.1/lib/python3.14/site-packages/_pytest/config/__init__.py:1464: PytestConfigWarning: Unknown config option: timeout23 >24 > self._warn_or_fail_if_strict(f"Unknown config option: {key}\n")25 >26 > ../../../../../store/gc3636lzigd9yjiv4yqadw95l57cd4la-python3.14-pytest-9.1.1/lib/python3.14/site-packages/_pytest/config/__init__.py:146427 > /nix/store/gc3636lzigd9yjiv4yqadw95l57cd4la-python3.14-pytest-9.1.1/lib/python3.14/site-packages/_pytest/config/__init__.py:1464: PytestConfigWarning: Unknown config option: timeout_method28 >29 > self._warn_or_fail_if_strict(f"Unknown config option: {key}\n")30 >31 > -- Docs: https://docs.pytest.org/en/stable/how-to/capture-warnings.html32 > =========================== short test summary info ============================33 > FAILED tests/test_discover.py::TestPreferInstalledRunners::test_a_module_without_main_is_not_runnable - AssertionError: assert ['/nix/store/4l8r0s2r5fna7src82b5fc2hixdvfyw0-python...34 > = 1 failed, 2060 passed, 13 skipped, 4 deselected, 2 warnings in 112.06s (0:01:52) =35 For full logs, run:36 nix log /nix/store/yrp8v9awgccv8p9p8gq2wh1r8qjnl559-mcptoon-0.8.18.drv37error: Cannot build '/nix/store/yrp8v9awgccv8p9p8gq2wh1r8qjnl559-mcptoon-0.8.18.drv'.38 Reason: builder failed with exit code 1.39 Output paths:40 /nix/store/hsz8k38mdckb435iymmgy79x1c6ha3nz-mcptoon-0.8.1841 /nix/store/mhsfk552l0l0ybyannw666rkahdkm4bj-mcptoon-0.8.18-dist42error: Cannot build '/nix/store/nkymp04gm26bn713aiszw49n2qmvnnbg-check-mcptoon.drv'.43 Reason: 1 dependency failed.44 Output paths:45 /nix/store/alzyjadlnxdkhzmbwy53wqqlbzn8sqk1-check-mcptoon