nixbot

builds

numtide/llm-agents.nix build #7282 failed

branch main · PR #10612 · commit f14d9ca4ad · · took 41m 29s · eval 15s

eval warnings 4 kinds · 8 occurrences
  • warn setting 'accept-flake-config' is ignored: iets never applies a flake's nixConfig, so a flake that sets extra-substituters or allow-import-from-derivation there runs without them; put the settings in nix.conf ×1
  • warn setting 'plugin-files' is ignored: iets loads no plugins ×1
  • warn stdenv.isLinux is deprecated, use stdenv.hostPlatform.isLinux instead ×3
  • warn stdenv.isDarwin is deprecated, use stdenv.hostPlatform.isDarwin instead ×3

1 failed
failed attributes
status attribute duration
failed checks.x86_64-linux.pkgs-aven 26m 35s
aven-0.1.47: ---- encrypted_tail_http::tests::membership::management::second_stale_race_stops_and_next_round_resolves_before_fresh_candidate stdout ---- thread …
aven-0.1.47:
---- encrypted_tail_http::tests::membership::management::second_stale_race_stops_and_next_round_resolves_before_fresh_candidate stdout ----
thread 'encrypted_tail_http::tests::membership::management::second_stale_race_stops_and_next_round_resolves_before_fresh_candidate' (27450) panicked at src/encrypted_tail_http/tests/membership/management.rs:639:10:
called `Result::unwrap()` on an `Err` value: error enrollment-network outcome-unknown
note: run with `RUST_BACKTRACE=1` environment variable to display a backtrace
failures:
    encrypted_tail_http::tests::membership::management::second_stale_race_stops_and_next_round_resolves_before_fresh_candidate
test result: FAILED. 2294 passed; 1 failed; 19 ignored; 0 measured; 20 filtered out; finished in 699.46s
error: test failed, to rerun pass `--lib`
15 succeeded
succeeded attributes
status attribute duration
loading…
605 already built
skipped attributes
status attribute duration
loading…