mcptoon-0.8.16
checks.aarch64-linux.pkgs-mcptoon
· build #7264
· raw
1elastic-arm-a5092f90: building sps83sbs484kr6p5nn9n8w2z4105id6m-mcptoon-0.8.16.drv2Sourcing python-remove-tests-dir-hook3Sourcing python-catch-conflicts-hook.sh4Sourcing python-remove-bin-bytecode-hook.sh5Sourcing pypa-build-hook6Using pypaBuildPhase7Sourcing python-runtime-deps-check-hook8Using pythonRuntimeDepsCheckHook9Sourcing pypa-install-hook10Using pypaInstallPhase11Sourcing python-imports-check-hook.sh12Using pythonImportsCheckPhase13Sourcing python-namespaces-hook14Sourcing python-catch-conflicts-hook.sh15Sourcing pytest-check-hook16Using pytestCheckPhase
unpackPhase
17unpacking source archive /nix/store/mz7jkwvgvy7mnkdsqxbxwsnz6clycdxa-source18source root is source19setting SOURCE_DATE_EPOCH to timestamp 315619200 of file "source/tests/test_xdg.py"configurePhase
20no configure script, doing nothingbuildPhase
21Executing pypaBuildPhase22Creating a wheel...23pypa build flags: --no-isolation --outdir dist/ --wheel24* Getting build dependencies for wheel...25/nix/store/idlwgfiz0sx90mimq3jjxl7vyi4pqspy-python3.14-setuptools-83.0.0/lib/python3.14/site-packages/setuptools/config/_apply_pyprojecttoml.py:82: SetuptoolsDeprecationWarning: `project.license` as a TOML table is deprecated26!!2728 ********************************************************************************29 Please use a simple string containing a SPDX expression for `project.license`. You can also use `project.license-files`. (Both options available on setuptools>=77.0.0).3031 By 2027-Feb-18, you need to update your project and remove deprecated calls32 or your builds will no longer be supported.3334 See https://packaging.python.org/en/latest/guides/writing-pyproject-toml/#license for details.35 ********************************************************************************3637!!38 corresp(dist, value, root_dir)39/nix/store/idlwgfiz0sx90mimq3jjxl7vyi4pqspy-python3.14-setuptools-83.0.0/lib/python3.14/site-packages/setuptools/config/_apply_pyprojecttoml.py:61: SetuptoolsDeprecationWarning: License classifiers are deprecated.40!!4142 ********************************************************************************43 Please consider removing the following classifiers in favor of a SPDX license expression:4445 License :: OSI Approved :: Apache Software License4647 See https://packaging.python.org/en/latest/guides/writing-pyproject-toml/#license for details.48 ********************************************************************************4950!!51 dist._finalize_license_expression()52/nix/store/idlwgfiz0sx90mimq3jjxl7vyi4pqspy-python3.14-setuptools-83.0.0/lib/python3.14/site-packages/setuptools/dist.py:765: SetuptoolsDeprecationWarning: License classifiers are deprecated.53!!5455 ********************************************************************************56 Please consider removing the following classifiers in favor of a SPDX license expression:5758 License :: OSI Approved :: Apache Software License5960 See https://packaging.python.org/en/latest/guides/writing-pyproject-toml/#license for details.61 ********************************************************************************6263!!64 self._finalize_license_expression()65running egg_info66creating src/mcptoon.egg-info67writing src/mcptoon.egg-info/PKG-INFO68writing dependency_links to src/mcptoon.egg-info/dependency_links.txt69writing entry points to src/mcptoon.egg-info/entry_points.txt70writing requirements to src/mcptoon.egg-info/requires.txt71writing top-level names to src/mcptoon.egg-info/top_level.txt72writing manifest file 'src/mcptoon.egg-info/SOURCES.txt'73reading manifest file 'src/mcptoon.egg-info/SOURCES.txt'74adding license file 'LICENSE'75adding license file 'NOTICE'76writing manifest file 'src/mcptoon.egg-info/SOURCES.txt'77* Building wheel...78/nix/store/idlwgfiz0sx90mimq3jjxl7vyi4pqspy-python3.14-setuptools-83.0.0/lib/python3.14/site-packages/setuptools/config/_apply_pyprojecttoml.py:82: SetuptoolsDeprecationWarning: `project.license` as a TOML table is deprecated79!!8081 ********************************************************************************82 Please use a simple string containing a SPDX expression for `project.license`. You can also use `project.license-files`. (Both options available on setuptools>=77.0.0).8384 By 2027-Feb-18, you need to update your project and remove deprecated calls85 or your builds will no longer be supported.8687 See https://packaging.python.org/en/latest/guides/writing-pyproject-toml/#license for details.88 ********************************************************************************8990!!91 corresp(dist, value, root_dir)92/nix/store/idlwgfiz0sx90mimq3jjxl7vyi4pqspy-python3.14-setuptools-83.0.0/lib/python3.14/site-packages/setuptools/config/_apply_pyprojecttoml.py:61: SetuptoolsDeprecationWarning: License classifiers are deprecated.93!!9495 ********************************************************************************96 Please consider removing the following classifiers in favor of a SPDX license expression:9798 License :: OSI Approved :: Apache Software License99100 See https://packaging.python.org/en/latest/guides/writing-pyproject-toml/#license for details.101 ********************************************************************************102103!!104 dist._finalize_license_expression()105/nix/store/idlwgfiz0sx90mimq3jjxl7vyi4pqspy-python3.14-setuptools-83.0.0/lib/python3.14/site-packages/setuptools/dist.py:765: SetuptoolsDeprecationWarning: License classifiers are deprecated.106!!107108 ********************************************************************************109 Please consider removing the following classifiers in favor of a SPDX license expression:110111 License :: OSI Approved :: Apache Software License112113 See https://packaging.python.org/en/latest/guides/writing-pyproject-toml/#license for details.114 ********************************************************************************115116!!117 self._finalize_license_expression()118running bdist_wheel119running build120running build_py121creating build/lib/mcptoon122copying src/mcptoon/bench_tokens.py -> build/lib/mcptoon123copying src/mcptoon/packs.py -> build/lib/mcptoon124copying src/mcptoon/sync.py -> build/lib/mcptoon125copying src/mcptoon/demo.py -> build/lib/mcptoon126copying src/mcptoon/errors.py -> build/lib/mcptoon127copying src/mcptoon/docs.py -> build/lib/mcptoon128copying src/mcptoon/config.py -> build/lib/mcptoon129copying src/mcptoon/cache.py -> build/lib/mcptoon130copying src/mcptoon/schema_simplifier.py -> build/lib/mcptoon131copying src/mcptoon/ccr.py -> build/lib/mcptoon132copying src/mcptoon/bench.py -> build/lib/mcptoon133copying src/mcptoon/watch.py -> build/lib/mcptoon134copying src/mcptoon/__init__.py -> build/lib/mcptoon135copying src/mcptoon/client.py -> build/lib/mcptoon136copying src/mcptoon/usage.py -> build/lib/mcptoon137copying src/mcptoon/serve.py -> build/lib/mcptoon138copying src/mcptoon/router.py -> build/lib/mcptoon139copying src/mcptoon/health.py -> build/lib/mcptoon140copying src/mcptoon/installer.py -> build/lib/mcptoon141copying src/mcptoon/cli.py -> build/lib/mcptoon142copying src/mcptoon/skills.py -> build/lib/mcptoon143copying src/mcptoon/report.py -> build/lib/mcptoon144copying src/mcptoon/__main__.py -> build/lib/mcptoon145copying src/mcptoon/headers.py -> build/lib/mcptoon146copying src/mcptoon/compressor.py -> build/lib/mcptoon147copying src/mcptoon/discover.py -> build/lib/mcptoon148copying src/mcptoon/output.py -> build/lib/mcptoon149copying src/mcptoon/native_tools.py -> build/lib/mcptoon150copying src/mcptoon/footer.py -> build/lib/mcptoon151copying src/mcptoon/demo_server.py -> build/lib/mcptoon152copying src/mcptoon/toon_vendored.py -> build/lib/mcptoon153copying src/mcptoon/plugin.py -> build/lib/mcptoon154copying src/mcptoon/manifest.py -> build/lib/mcptoon155copying src/mcptoon/welcome.py -> build/lib/mcptoon156copying src/mcptoon/update.py -> build/lib/mcptoon157creating build/lib/mcptoon/_toon158copying src/mcptoon/_toon/writer.py -> build/lib/mcptoon/_toon159copying src/mcptoon/_toon/__init__.py -> build/lib/mcptoon/_toon160copying src/mcptoon/_toon/decoder.py -> build/lib/mcptoon/_toon161copying src/mcptoon/_toon/primitives.py -> build/lib/mcptoon/_toon162copying src/mcptoon/_toon/encoders.py -> build/lib/mcptoon/_toon163copying src/mcptoon/_toon/constants.py -> build/lib/mcptoon/_toon164copying src/mcptoon/_toon/types.py -> build/lib/mcptoon/_toon165copying src/mcptoon/_toon/normalize.py -> build/lib/mcptoon/_toon166copying src/mcptoon/_toon/encoder.py -> build/lib/mcptoon/_toon167running egg_info168writing src/mcptoon.egg-info/PKG-INFO169writing dependency_links to src/mcptoon.egg-info/dependency_links.txt170writing entry points to src/mcptoon.egg-info/entry_points.txt171writing requirements to src/mcptoon.egg-info/requires.txt172writing top-level names to src/mcptoon.egg-info/top_level.txt173reading manifest file 'src/mcptoon.egg-info/SOURCES.txt'174adding license file 'LICENSE'175adding license file 'NOTICE'176writing manifest file 'src/mcptoon.egg-info/SOURCES.txt'177copying src/mcptoon/packs.json -> build/lib/mcptoon178creating build/lib/mcptoon/skill179copying src/mcptoon/skill/SKILL.md -> build/lib/mcptoon/skill180installing to build/bdist.linux-aarch64/wheel181running install182running install_lib183creating build/bdist.linux-aarch64/wheel184creating build/bdist.linux-aarch64/wheel/mcptoon185copying build/lib/mcptoon/bench_tokens.py -> build/bdist.linux-aarch64/wheel/./mcptoon186copying build/lib/mcptoon/packs.py -> build/bdist.linux-aarch64/wheel/./mcptoon187copying build/lib/mcptoon/sync.py -> build/bdist.linux-aarch64/wheel/./mcptoon188copying build/lib/mcptoon/demo.py -> build/bdist.linux-aarch64/wheel/./mcptoon189copying build/lib/mcptoon/errors.py -> build/bdist.linux-aarch64/wheel/./mcptoon190copying build/lib/mcptoon/docs.py -> build/bdist.linux-aarch64/wheel/./mcptoon191copying build/lib/mcptoon/config.py -> build/bdist.linux-aarch64/wheel/./mcptoon192creating build/bdist.linux-aarch64/wheel/mcptoon/skill193copying build/lib/mcptoon/skill/SKILL.md -> build/bdist.linux-aarch64/wheel/./mcptoon/skill194copying build/lib/mcptoon/cache.py -> build/bdist.linux-aarch64/wheel/./mcptoon195copying build/lib/mcptoon/schema_simplifier.py -> build/bdist.linux-aarch64/wheel/./mcptoon196copying build/lib/mcptoon/ccr.py -> build/bdist.linux-aarch64/wheel/./mcptoon197copying build/lib/mcptoon/bench.py -> build/bdist.linux-aarch64/wheel/./mcptoon198copying build/lib/mcptoon/watch.py -> build/bdist.linux-aarch64/wheel/./mcptoon199copying build/lib/mcptoon/__init__.py -> build/bdist.linux-aarch64/wheel/./mcptoon200copying build/lib/mcptoon/client.py -> build/bdist.linux-aarch64/wheel/./mcptoon201copying build/lib/mcptoon/usage.py -> build/bdist.linux-aarch64/wheel/./mcptoon202copying build/lib/mcptoon/serve.py -> build/bdist.linux-aarch64/wheel/./mcptoon203copying build/lib/mcptoon/router.py -> build/bdist.linux-aarch64/wheel/./mcptoon204creating build/bdist.linux-aarch64/wheel/mcptoon/_toon205copying build/lib/mcptoon/_toon/writer.py -> build/bdist.linux-aarch64/wheel/./mcptoon/_toon206copying build/lib/mcptoon/_toon/__init__.py -> build/bdist.linux-aarch64/wheel/./mcptoon/_toon207copying build/lib/mcptoon/_toon/decoder.py -> build/bdist.linux-aarch64/wheel/./mcptoon/_toon208copying build/lib/mcptoon/_toon/primitives.py -> build/bdist.linux-aarch64/wheel/./mcptoon/_toon209copying build/lib/mcptoon/_toon/encoders.py -> build/bdist.linux-aarch64/wheel/./mcptoon/_toon210copying build/lib/mcptoon/_toon/constants.py -> build/bdist.linux-aarch64/wheel/./mcptoon/_toon211copying build/lib/mcptoon/_toon/types.py -> build/bdist.linux-aarch64/wheel/./mcptoon/_toon212copying build/lib/mcptoon/_toon/normalize.py -> build/bdist.linux-aarch64/wheel/./mcptoon/_toon213copying build/lib/mcptoon/_toon/encoder.py -> build/bdist.linux-aarch64/wheel/./mcptoon/_toon214copying build/lib/mcptoon/health.py -> build/bdist.linux-aarch64/wheel/./mcptoon215copying build/lib/mcptoon/installer.py -> build/bdist.linux-aarch64/wheel/./mcptoon216copying build/lib/mcptoon/cli.py -> build/bdist.linux-aarch64/wheel/./mcptoon217copying build/lib/mcptoon/skills.py -> build/bdist.linux-aarch64/wheel/./mcptoon218copying build/lib/mcptoon/report.py -> build/bdist.linux-aarch64/wheel/./mcptoon219copying build/lib/mcptoon/__main__.py -> build/bdist.linux-aarch64/wheel/./mcptoon220copying build/lib/mcptoon/packs.json -> build/bdist.linux-aarch64/wheel/./mcptoon221copying build/lib/mcptoon/headers.py -> build/bdist.linux-aarch64/wheel/./mcptoon222copying build/lib/mcptoon/compressor.py -> build/bdist.linux-aarch64/wheel/./mcptoon223copying build/lib/mcptoon/discover.py -> build/bdist.linux-aarch64/wheel/./mcptoon224copying build/lib/mcptoon/output.py -> build/bdist.linux-aarch64/wheel/./mcptoon225copying build/lib/mcptoon/native_tools.py -> build/bdist.linux-aarch64/wheel/./mcptoon226copying build/lib/mcptoon/footer.py -> build/bdist.linux-aarch64/wheel/./mcptoon227copying build/lib/mcptoon/demo_server.py -> build/bdist.linux-aarch64/wheel/./mcptoon228copying build/lib/mcptoon/toon_vendored.py -> build/bdist.linux-aarch64/wheel/./mcptoon229copying build/lib/mcptoon/plugin.py -> build/bdist.linux-aarch64/wheel/./mcptoon230copying build/lib/mcptoon/manifest.py -> build/bdist.linux-aarch64/wheel/./mcptoon231copying build/lib/mcptoon/welcome.py -> build/bdist.linux-aarch64/wheel/./mcptoon232copying build/lib/mcptoon/update.py -> build/bdist.linux-aarch64/wheel/./mcptoon233running install_egg_info234Copying src/mcptoon.egg-info to build/bdist.linux-aarch64/wheel/./mcptoon-0.8.16-py3.14.egg-info235running install_scripts236creating build/bdist.linux-aarch64/wheel/mcptoon-0.8.16.dist-info/WHEEL237creating '/build/source/dist/.tmp-yurxu77k/mcptoon-0.8.16-py3-none-any.whl' and adding 'build/bdist.linux-aarch64/wheel' to it238adding 'mcptoon/__init__.py'239adding 'mcptoon/__main__.py'240adding 'mcptoon/bench.py'241adding 'mcptoon/bench_tokens.py'242adding 'mcptoon/cache.py'243adding 'mcptoon/ccr.py'244adding 'mcptoon/cli.py'245adding 'mcptoon/client.py'246adding 'mcptoon/compressor.py'247adding 'mcptoon/config.py'248adding 'mcptoon/demo.py'249adding 'mcptoon/demo_server.py'250adding 'mcptoon/discover.py'251adding 'mcptoon/docs.py'252adding 'mcptoon/errors.py'253adding 'mcptoon/footer.py'254adding 'mcptoon/headers.py'255adding 'mcptoon/health.py'256adding 'mcptoon/installer.py'257adding 'mcptoon/manifest.py'258adding 'mcptoon/native_tools.py'259adding 'mcptoon/output.py'260adding 'mcptoon/packs.json'261adding 'mcptoon/packs.py'262adding 'mcptoon/plugin.py'263adding 'mcptoon/report.py'264adding 'mcptoon/router.py'265adding 'mcptoon/schema_simplifier.py'266adding 'mcptoon/serve.py'267adding 'mcptoon/skills.py'268adding 'mcptoon/sync.py'269adding 'mcptoon/toon_vendored.py'270adding 'mcptoon/update.py'271adding 'mcptoon/usage.py'272adding 'mcptoon/watch.py'273adding 'mcptoon/welcome.py'274adding 'mcptoon/_toon/__init__.py'275adding 'mcptoon/_toon/constants.py'276adding 'mcptoon/_toon/decoder.py'277adding 'mcptoon/_toon/encoder.py'278adding 'mcptoon/_toon/encoders.py'279adding 'mcptoon/_toon/normalize.py'280adding 'mcptoon/_toon/primitives.py'281adding 'mcptoon/_toon/types.py'282adding 'mcptoon/_toon/writer.py'283adding 'mcptoon/skill/SKILL.md'284adding 'mcptoon-0.8.16.dist-info/licenses/LICENSE'285adding 'mcptoon-0.8.16.dist-info/licenses/NOTICE'286adding 'mcptoon-0.8.16.dist-info/METADATA'287adding 'mcptoon-0.8.16.dist-info/WHEEL'288adding 'mcptoon-0.8.16.dist-info/entry_points.txt'289adding 'mcptoon-0.8.16.dist-info/top_level.txt'290adding 'mcptoon-0.8.16.dist-info/RECORD'291removing build/bdist.linux-aarch64/wheel292Successfully built mcptoon-0.8.16-py3-none-any.whl293Finished creating a wheel...294Finished executing pypaBuildPhasepythonRuntimeDepsCheckHook
295Executing pythonRuntimeDepsCheck296Checking runtime dependencies for mcptoon-0.8.16-py3-none-any.whl297Finished executing pythonRuntimeDepsCheckinstallPhase
298Executing pypaInstallPhase299Successfully installed mcptoon-0.8.16-py3-none-any.whl300Finished executing pypaInstallPhasepythonOutputDistPhase
301Executing pythonOutputDistPhase302Finished executing pythonOutputDistPhasefixupPhase
303shrinking RPATHs of ELF executables and libraries in /nix/store/667mnlw5y3gpk7wswq66wsixwvglvb9i-mcptoon-0.8.16304checking for references to /build/ in /nix/store/667mnlw5y3gpk7wswq66wsixwvglvb9i-mcptoon-0.8.16...305patching script interpreter paths in /nix/store/667mnlw5y3gpk7wswq66wsixwvglvb9i-mcptoon-0.8.16306stripping (with command strip and flags -S -p) in /nix/store/667mnlw5y3gpk7wswq66wsixwvglvb9i-mcptoon-0.8.16/lib /nix/store/667mnlw5y3gpk7wswq66wsixwvglvb9i-mcptoon-0.8.16/bin307shrinking RPATHs of ELF executables and libraries in /nix/store/1y4n5nib0figy247m5ycmll385q63kyb-mcptoon-0.8.16-dist308checking for references to /build/ in /nix/store/1y4n5nib0figy247m5ycmll385q63kyb-mcptoon-0.8.16-dist...309patching script interpreter paths in /nix/store/1y4n5nib0figy247m5ycmll385q63kyb-mcptoon-0.8.16-dist310Rewriting #!/nix/store/3fl7bdkdxk2k4nssy1d1161isbzn6bsr-python3-3.14.7/bin/python3.14 to #!/nix/store/3fl7bdkdxk2k4nssy1d1161isbzn6bsr-python3-3.14.7311wrapping `/nix/store/667mnlw5y3gpk7wswq66wsixwvglvb9i-mcptoon-0.8.16/bin/mcptoon'...312Executing pythonRemoveTestsDir313Finished executing pythonRemoveTestsDirinstallCheckPhase
314no Makefile or custom installCheckPhase, doing nothingpythonImportsCheckPhase
315Executing pythonImportsCheckPhase316Check whether the following modules can be imported: mcptoonpytestCheckPhase
317Executing pytestCheckPhase318pytest flags: -m pytest -k not\ \(test_search_registry_returns_list\)\ and\ not\ \(test_search_smithery_returns_list\)\ and\ not\ \(test_search_mcp_registry_returns_list\)\ and\ not\ \(test_packaged_path_resolves_to_the_copy_on_disk\)319============================= test session starts ==============================320platform linux -- Python 3.14.7, pytest-9.1.1, pluggy-1.6.0321rootdir: /build/source322configfile: pyproject.toml323testpaths: tests324collected 2007 items / 4 deselected / 2003 selected 325326tests/test_add_url_validation.py .............. [ 0%]327tests/test_bench.py ............. [ 1%]328tests/test_bench_tokens.py ....ss.. [ 1%]329tests/test_benchmark_repro.py sss........... [ 2%]330tests/test_cache.py .... [ 2%]331tests/test_calculator.py .......................... [ 3%]332tests/test_ccr.py ...................... [ 5%]333tests/test_ccr_http_session.py ....... [ 5%]334tests/test_ccr_lossless.py .......................... [ 6%]335tests/test_claude_plugin_package.py ............. [ 7%]336tests/test_cli_flags.py ................... [ 8%]337tests/test_cli_smoke.py ....... [ 8%]338tests/test_client.py .............................. [ 10%]339tests/test_command_coverage.py ......... [ 10%]340tests/test_completion.py ........... [ 11%]341tests/test_compressor.py .................................. [ 12%]342tests/test_config.py .................... [ 13%]343tests/test_dead_server_diagnostics.py ... [ 13%]344tests/test_demo.py ..................... [ 15%]345tests/test_demo_dead_package.py ........ [ 15%]346tests/test_demo_server.py .............................................. [ 17%]347..... [ 17%]348tests/test_discover.py .......................................F... [ 20%]349tests/test_docs.py .............................................. [ 22%]350tests/test_doctor_star_hint.py ....... [ 22%]351tests/test_envelope.py ........ [ 23%]352tests/test_exit_codes.py ......................... [ 24%]353tests/test_fallback_json.py ...... [ 24%]354tests/test_footer_broadcast.py ......................................... [ 26%]355.... [ 26%]356tests/test_footprint_claims.py ............ [ 27%]357tests/test_gemini_manifest.py ...... [ 27%]358tests/test_health.py .............. [ 28%]359tests/test_help_shortcircuit.py ......... [ 29%]360tests/test_honest_counts.py ................ [ 29%]361tests/test_http_user_agent.py ......... [ 30%]362tests/test_import.py ..................... [ 31%]363tests/test_installer_registry.py ................................. [ 32%]364tests/test_lang.py .............................. [ 34%]365tests/test_llms_txt.py ...... [ 34%]366tests/test_machine_readable_output.py .......................... [ 36%]367tests/test_native_tools.py ............................................. [ 38%]368........................ [ 39%]369tests/test_next_step_works.py ................. [ 40%]370tests/test_output.py ................................................... [ 42%]371........................................................................ [ 46%]372................ [ 47%]373tests/test_plugin_install.py .......... [ 47%]374tests/test_plugin_scan.py ............................... [ 49%]375tests/test_policy_overrides.py ................ [ 50%]376tests/test_presence.py ................................................. [ 52%]377............. [ 53%]378tests/test_readme_links.py ... [ 53%]379tests/test_registry_sync.py ............. [ 54%]380tests/test_report.py .............. [ 54%]381tests/test_reversible.py ............................................... [ 57%]382................... [ 58%]383tests/test_router.py .............................................. [ 60%]384tests/test_schema_call_e2e.py .. [ 60%]385tests/test_search.py ................................... [ 62%]386tests/test_serve.py .................................................... [ 64%]387.............. [ 65%]388tests/test_serve_perf.py .......... [ 65%]389tests/test_serve_prompts.py ........ [ 66%]390tests/test_skill_package.py ............................. [ 67%]391tests/test_skill_packs.py ................ [ 68%]392tests/test_skill_search.py .......... [ 69%]393tests/test_skills.py ................................................... [ 71%]394.....................ss................................................. [ 75%]395...................................... [ 77%]396tests/test_smart_compress_e2e.py .................. [ 78%]397tests/test_smart_reachability.py ..... [ 78%]398tests/test_source_tracked.py sss [ 78%]399tests/test_stats_toggle.py ......... [ 78%]400tests/test_stderr_pipe_deadlock.py .... [ 79%]401tests/test_sync.py ..................................................... [ 81%]402................................................... [ 84%]403tests/test_tier_claims_consistent.py .... [ 84%]404tests/test_toml_config.py .......................... [ 85%]405tests/test_toon_cross_validate.py ............................... [ 87%]406tests/test_uninstall_end_to_end.py .......... [ 87%]407tests/test_update.py .................... [ 88%]408tests/test_v02_features.py .................................... [ 90%]409tests/test_v04_features.py ................ [ 91%]410tests/test_v05_features.py ...................... [ 92%]411tests/test_v072_delight.py .....................s.. [ 93%]412tests/test_v073_http_security.py .............................. [ 95%]413tests/test_v074_stdio_timeout.py ............ [ 95%]414tests/test_v076_stateless_serve.py ................... [ 96%]415tests/test_v07_spec2026.py ..................... [ 97%]416tests/test_v081_env_headers.py ............. [ 98%]417tests/test_watch.py .................. [ 99%]418tests/test_xdg.py ............. [100%]419420=================================== FAILURES ===================================421____ TestPreferInstalledRunners.test_a_module_without_main_is_not_runnable _____422423self = <tests.test_discover.TestPreferInstalledRunners object at 0xfffff4af3a80>424425 def test_a_module_without_main_is_not_runnable(self):426 """`json` resolves but has no `__main__`, so `python -m json` would die.427 428 Pin the real function (not a mock) against a stdlib module that is429 importable everywhere — this is the check that keeps a bare430 `find_spec(module)` from writing a dead server entry.431 """432> assert discover_mod._resolve_local_module("json") is None433E AssertionError: assert ['/nix/store/3fl7bdkdxk2k4nssy1d1161isbzn6bsr-python3-3.14.7/bin/python3.14', '-m', 'json'] is None434E + where ['/nix/store/3fl7bdkdxk2k4nssy1d1161isbzn6bsr-python3-3.14.7/bin/python3.14', '-m', 'json'] = <function _resolve_local_module at 0xfffff4c43060>('json')435E + where <function _resolve_local_module at 0xfffff4c43060> = discover_mod._resolve_local_module436437tests/test_discover.py:472: AssertionError438=========================== short test summary info ============================439FAILED tests/test_discover.py::TestPreferInstalledRunners::test_a_module_without_main_is_not_runnable - AssertionError: assert ['/nix/store/3fl7bdkdxk2k4nssy1d1161isbzn6bsr-python...440===== 1 failed, 1991 passed, 11 skipped, 4 deselected in 88.72s (0:01:28) ======