nixbot

builds

failed mcptoon-0.8.16 checks.x86_64-linux.pkgs-mcptoon · build #7241 · raw

1Sourcing python-remove-tests-dir-hook2Sourcing python-catch-conflicts-hook.sh3Sourcing python-remove-bin-bytecode-hook.sh4Sourcing pypa-build-hook5Using pypaBuildPhase6Sourcing python-runtime-deps-check-hook7Using pythonRuntimeDepsCheckHook8Sourcing pypa-install-hook9Using pypaInstallPhase10Sourcing python-imports-check-hook.sh11Using pythonImportsCheckPhase12Sourcing python-namespaces-hook13Sourcing python-catch-conflicts-hook.sh14Sourcing pytest-check-hook15Using pytestCheckPhase
unpackPhase
16unpacking source archive /nix/store/mz7jkwvgvy7mnkdsqxbxwsnz6clycdxa-source17source root is source18setting SOURCE_DATE_EPOCH to timestamp 315619200 of file "source/tests/test_xdg.py"
configurePhase
19no configure script, doing nothing
buildPhase
20Executing pypaBuildPhase21Creating a wheel...22pypa build flags: --no-isolation --outdir dist/ --wheel23* Getting build dependencies for wheel...24/nix/store/gyficbimx12q5975523ps3kjzz8ys4pq-python3.14-setuptools-83.0.0/lib/python3.14/site-packages/setuptools/config/_apply_pyprojecttoml.py:82: SetuptoolsDeprecationWarning: `project.license` as a TOML table is deprecated25!!2627 ********************************************************************************28 Please use a simple string containing a SPDX expression for `project.license`. You can also use `project.license-files`. (Both options available on setuptools>=77.0.0).2930 By 2027-Feb-18, you need to update your project and remove deprecated calls31 or your builds will no longer be supported.3233 See https://packaging.python.org/en/latest/guides/writing-pyproject-toml/#license for details.34 ********************************************************************************3536!!37 corresp(dist, value, root_dir)38/nix/store/gyficbimx12q5975523ps3kjzz8ys4pq-python3.14-setuptools-83.0.0/lib/python3.14/site-packages/setuptools/config/_apply_pyprojecttoml.py:61: SetuptoolsDeprecationWarning: License classifiers are deprecated.39!!4041 ********************************************************************************42 Please consider removing the following classifiers in favor of a SPDX license expression:4344 License :: OSI Approved :: Apache Software License4546 See https://packaging.python.org/en/latest/guides/writing-pyproject-toml/#license for details.47 ********************************************************************************4849!!50 dist._finalize_license_expression()51/nix/store/gyficbimx12q5975523ps3kjzz8ys4pq-python3.14-setuptools-83.0.0/lib/python3.14/site-packages/setuptools/dist.py:765: SetuptoolsDeprecationWarning: License classifiers are deprecated.52!!5354 ********************************************************************************55 Please consider removing the following classifiers in favor of a SPDX license expression:5657 License :: OSI Approved :: Apache Software License5859 See https://packaging.python.org/en/latest/guides/writing-pyproject-toml/#license for details.60 ********************************************************************************6162!!63 self._finalize_license_expression()64running egg_info65creating src/mcptoon.egg-info66writing src/mcptoon.egg-info/PKG-INFO67writing dependency_links to src/mcptoon.egg-info/dependency_links.txt68writing entry points to src/mcptoon.egg-info/entry_points.txt69writing requirements to src/mcptoon.egg-info/requires.txt70writing top-level names to src/mcptoon.egg-info/top_level.txt71writing manifest file 'src/mcptoon.egg-info/SOURCES.txt'72reading manifest file 'src/mcptoon.egg-info/SOURCES.txt'73adding license file 'LICENSE'74adding license file 'NOTICE'75writing manifest file 'src/mcptoon.egg-info/SOURCES.txt'76* Building wheel...77/nix/store/gyficbimx12q5975523ps3kjzz8ys4pq-python3.14-setuptools-83.0.0/lib/python3.14/site-packages/setuptools/config/_apply_pyprojecttoml.py:82: SetuptoolsDeprecationWarning: `project.license` as a TOML table is deprecated78!!7980 ********************************************************************************81 Please use a simple string containing a SPDX expression for `project.license`. You can also use `project.license-files`. (Both options available on setuptools>=77.0.0).8283 By 2027-Feb-18, you need to update your project and remove deprecated calls84 or your builds will no longer be supported.8586 See https://packaging.python.org/en/latest/guides/writing-pyproject-toml/#license for details.87 ********************************************************************************8889!!90 corresp(dist, value, root_dir)91/nix/store/gyficbimx12q5975523ps3kjzz8ys4pq-python3.14-setuptools-83.0.0/lib/python3.14/site-packages/setuptools/config/_apply_pyprojecttoml.py:61: SetuptoolsDeprecationWarning: License classifiers are deprecated.92!!9394 ********************************************************************************95 Please consider removing the following classifiers in favor of a SPDX license expression:9697 License :: OSI Approved :: Apache Software License9899 See https://packaging.python.org/en/latest/guides/writing-pyproject-toml/#license for details.100 ********************************************************************************101102!!103 dist._finalize_license_expression()104/nix/store/gyficbimx12q5975523ps3kjzz8ys4pq-python3.14-setuptools-83.0.0/lib/python3.14/site-packages/setuptools/dist.py:765: SetuptoolsDeprecationWarning: License classifiers are deprecated.105!!106107 ********************************************************************************108 Please consider removing the following classifiers in favor of a SPDX license expression:109110 License :: OSI Approved :: Apache Software License111112 See https://packaging.python.org/en/latest/guides/writing-pyproject-toml/#license for details.113 ********************************************************************************114115!!116 self._finalize_license_expression()117running bdist_wheel118running build119running build_py120creating build/lib/mcptoon121copying src/mcptoon/welcome.py -> build/lib/mcptoon122copying src/mcptoon/demo.py -> build/lib/mcptoon123copying src/mcptoon/skills.py -> build/lib/mcptoon124copying src/mcptoon/client.py -> build/lib/mcptoon125copying src/mcptoon/packs.py -> build/lib/mcptoon126copying src/mcptoon/serve.py -> build/lib/mcptoon127copying src/mcptoon/usage.py -> build/lib/mcptoon128copying src/mcptoon/manifest.py -> build/lib/mcptoon129copying src/mcptoon/docs.py -> build/lib/mcptoon130copying src/mcptoon/errors.py -> build/lib/mcptoon131copying src/mcptoon/__main__.py -> build/lib/mcptoon132copying src/mcptoon/cli.py -> build/lib/mcptoon133copying src/mcptoon/sync.py -> build/lib/mcptoon134copying src/mcptoon/demo_server.py -> build/lib/mcptoon135copying src/mcptoon/output.py -> build/lib/mcptoon136copying src/mcptoon/discover.py -> build/lib/mcptoon137copying src/mcptoon/compressor.py -> build/lib/mcptoon138copying src/mcptoon/plugin.py -> build/lib/mcptoon139copying src/mcptoon/update.py -> build/lib/mcptoon140copying src/mcptoon/footer.py -> build/lib/mcptoon141copying src/mcptoon/schema_simplifier.py -> build/lib/mcptoon142copying src/mcptoon/bench.py -> build/lib/mcptoon143copying src/mcptoon/watch.py -> build/lib/mcptoon144copying src/mcptoon/headers.py -> build/lib/mcptoon145copying src/mcptoon/health.py -> build/lib/mcptoon146copying src/mcptoon/cache.py -> build/lib/mcptoon147copying src/mcptoon/ccr.py -> build/lib/mcptoon148copying src/mcptoon/installer.py -> build/lib/mcptoon149copying src/mcptoon/__init__.py -> build/lib/mcptoon150copying src/mcptoon/config.py -> build/lib/mcptoon151copying src/mcptoon/router.py -> build/lib/mcptoon152copying src/mcptoon/toon_vendored.py -> build/lib/mcptoon153copying src/mcptoon/native_tools.py -> build/lib/mcptoon154copying src/mcptoon/report.py -> build/lib/mcptoon155copying src/mcptoon/bench_tokens.py -> build/lib/mcptoon156creating build/lib/mcptoon/_toon157copying src/mcptoon/_toon/types.py -> build/lib/mcptoon/_toon158copying src/mcptoon/_toon/encoders.py -> build/lib/mcptoon/_toon159copying src/mcptoon/_toon/normalize.py -> build/lib/mcptoon/_toon160copying src/mcptoon/_toon/constants.py -> build/lib/mcptoon/_toon161copying src/mcptoon/_toon/decoder.py -> build/lib/mcptoon/_toon162copying src/mcptoon/_toon/writer.py -> build/lib/mcptoon/_toon163copying src/mcptoon/_toon/encoder.py -> build/lib/mcptoon/_toon164copying src/mcptoon/_toon/primitives.py -> build/lib/mcptoon/_toon165copying src/mcptoon/_toon/__init__.py -> build/lib/mcptoon/_toon166running egg_info167writing src/mcptoon.egg-info/PKG-INFO168writing dependency_links to src/mcptoon.egg-info/dependency_links.txt169writing entry points to src/mcptoon.egg-info/entry_points.txt170writing requirements to src/mcptoon.egg-info/requires.txt171writing top-level names to src/mcptoon.egg-info/top_level.txt172reading manifest file 'src/mcptoon.egg-info/SOURCES.txt'173adding license file 'LICENSE'174adding license file 'NOTICE'175writing manifest file 'src/mcptoon.egg-info/SOURCES.txt'176copying src/mcptoon/packs.json -> build/lib/mcptoon177creating build/lib/mcptoon/skill178copying src/mcptoon/skill/SKILL.md -> build/lib/mcptoon/skill179installing to build/bdist.linux-x86_64/wheel180running install181running install_lib182creating build/bdist.linux-x86_64/wheel183creating build/bdist.linux-x86_64/wheel/mcptoon184copying build/lib/mcptoon/docs.py -> build/bdist.linux-x86_64/wheel/./mcptoon185copying build/lib/mcptoon/installer.py -> build/bdist.linux-x86_64/wheel/./mcptoon186copying build/lib/mcptoon/client.py -> build/bdist.linux-x86_64/wheel/./mcptoon187copying build/lib/mcptoon/demo.py -> build/bdist.linux-x86_64/wheel/./mcptoon188copying build/lib/mcptoon/welcome.py -> build/bdist.linux-x86_64/wheel/./mcptoon189copying build/lib/mcptoon/skills.py -> build/bdist.linux-x86_64/wheel/./mcptoon190copying build/lib/mcptoon/plugin.py -> build/bdist.linux-x86_64/wheel/./mcptoon191copying build/lib/mcptoon/output.py -> build/bdist.linux-x86_64/wheel/./mcptoon192copying build/lib/mcptoon/packs.py -> build/bdist.linux-x86_64/wheel/./mcptoon193copying build/lib/mcptoon/serve.py -> build/bdist.linux-x86_64/wheel/./mcptoon194copying build/lib/mcptoon/sync.py -> build/bdist.linux-x86_64/wheel/./mcptoon195copying build/lib/mcptoon/errors.py -> build/bdist.linux-x86_64/wheel/./mcptoon196copying build/lib/mcptoon/cli.py -> build/bdist.linux-x86_64/wheel/./mcptoon197copying build/lib/mcptoon/__init__.py -> build/bdist.linux-x86_64/wheel/./mcptoon198copying build/lib/mcptoon/usage.py -> build/bdist.linux-x86_64/wheel/./mcptoon199copying build/lib/mcptoon/manifest.py -> build/bdist.linux-x86_64/wheel/./mcptoon200copying build/lib/mcptoon/headers.py -> build/bdist.linux-x86_64/wheel/./mcptoon201creating build/bdist.linux-x86_64/wheel/mcptoon/skill202copying build/lib/mcptoon/skill/SKILL.md -> build/bdist.linux-x86_64/wheel/./mcptoon/skill203creating build/bdist.linux-x86_64/wheel/mcptoon/_toon204copying build/lib/mcptoon/_toon/encoders.py -> build/bdist.linux-x86_64/wheel/./mcptoon/_toon205copying build/lib/mcptoon/_toon/encoder.py -> build/bdist.linux-x86_64/wheel/./mcptoon/_toon206copying build/lib/mcptoon/_toon/writer.py -> build/bdist.linux-x86_64/wheel/./mcptoon/_toon207copying build/lib/mcptoon/_toon/primitives.py -> build/bdist.linux-x86_64/wheel/./mcptoon/_toon208copying build/lib/mcptoon/_toon/decoder.py -> build/bdist.linux-x86_64/wheel/./mcptoon/_toon209copying build/lib/mcptoon/_toon/normalize.py -> build/bdist.linux-x86_64/wheel/./mcptoon/_toon210copying build/lib/mcptoon/_toon/__init__.py -> build/bdist.linux-x86_64/wheel/./mcptoon/_toon211copying build/lib/mcptoon/_toon/constants.py -> build/bdist.linux-x86_64/wheel/./mcptoon/_toon212copying build/lib/mcptoon/_toon/types.py -> build/bdist.linux-x86_64/wheel/./mcptoon/_toon213copying build/lib/mcptoon/health.py -> build/bdist.linux-x86_64/wheel/./mcptoon214copying build/lib/mcptoon/ccr.py -> build/bdist.linux-x86_64/wheel/./mcptoon215copying build/lib/mcptoon/footer.py -> build/bdist.linux-x86_64/wheel/./mcptoon216copying build/lib/mcptoon/schema_simplifier.py -> build/bdist.linux-x86_64/wheel/./mcptoon217copying build/lib/mcptoon/update.py -> build/bdist.linux-x86_64/wheel/./mcptoon218copying build/lib/mcptoon/packs.json -> build/bdist.linux-x86_64/wheel/./mcptoon219copying build/lib/mcptoon/bench.py -> build/bdist.linux-x86_64/wheel/./mcptoon220copying build/lib/mcptoon/watch.py -> build/bdist.linux-x86_64/wheel/./mcptoon221copying build/lib/mcptoon/report.py -> build/bdist.linux-x86_64/wheel/./mcptoon222copying build/lib/mcptoon/discover.py -> build/bdist.linux-x86_64/wheel/./mcptoon223copying build/lib/mcptoon/demo_server.py -> build/bdist.linux-x86_64/wheel/./mcptoon224copying build/lib/mcptoon/router.py -> build/bdist.linux-x86_64/wheel/./mcptoon225copying build/lib/mcptoon/compressor.py -> build/bdist.linux-x86_64/wheel/./mcptoon226copying build/lib/mcptoon/bench_tokens.py -> build/bdist.linux-x86_64/wheel/./mcptoon227copying build/lib/mcptoon/native_tools.py -> build/bdist.linux-x86_64/wheel/./mcptoon228copying build/lib/mcptoon/config.py -> build/bdist.linux-x86_64/wheel/./mcptoon229copying build/lib/mcptoon/toon_vendored.py -> build/bdist.linux-x86_64/wheel/./mcptoon230copying build/lib/mcptoon/cache.py -> build/bdist.linux-x86_64/wheel/./mcptoon231copying build/lib/mcptoon/__main__.py -> build/bdist.linux-x86_64/wheel/./mcptoon232running install_egg_info233Copying src/mcptoon.egg-info to build/bdist.linux-x86_64/wheel/./mcptoon-0.8.16-py3.14.egg-info234running install_scripts235creating build/bdist.linux-x86_64/wheel/mcptoon-0.8.16.dist-info/WHEEL236creating '/build/source/dist/.tmp-tcb3g0ws/mcptoon-0.8.16-py3-none-any.whl' and adding 'build/bdist.linux-x86_64/wheel' to it237adding 'mcptoon/__init__.py'238adding 'mcptoon/__main__.py'239adding 'mcptoon/bench.py'240adding 'mcptoon/bench_tokens.py'241adding 'mcptoon/cache.py'242adding 'mcptoon/ccr.py'243adding 'mcptoon/cli.py'244adding 'mcptoon/client.py'245adding 'mcptoon/compressor.py'246adding 'mcptoon/config.py'247adding 'mcptoon/demo.py'248adding 'mcptoon/demo_server.py'249adding 'mcptoon/discover.py'250adding 'mcptoon/docs.py'251adding 'mcptoon/errors.py'252adding 'mcptoon/footer.py'253adding 'mcptoon/headers.py'254adding 'mcptoon/health.py'255adding 'mcptoon/installer.py'256adding 'mcptoon/manifest.py'257adding 'mcptoon/native_tools.py'258adding 'mcptoon/output.py'259adding 'mcptoon/packs.json'260adding 'mcptoon/packs.py'261adding 'mcptoon/plugin.py'262adding 'mcptoon/report.py'263adding 'mcptoon/router.py'264adding 'mcptoon/schema_simplifier.py'265adding 'mcptoon/serve.py'266adding 'mcptoon/skills.py'267adding 'mcptoon/sync.py'268adding 'mcptoon/toon_vendored.py'269adding 'mcptoon/update.py'270adding 'mcptoon/usage.py'271adding 'mcptoon/watch.py'272adding 'mcptoon/welcome.py'273adding 'mcptoon/_toon/__init__.py'274adding 'mcptoon/_toon/constants.py'275adding 'mcptoon/_toon/decoder.py'276adding 'mcptoon/_toon/encoder.py'277adding 'mcptoon/_toon/encoders.py'278adding 'mcptoon/_toon/normalize.py'279adding 'mcptoon/_toon/primitives.py'280adding 'mcptoon/_toon/types.py'281adding 'mcptoon/_toon/writer.py'282adding 'mcptoon/skill/SKILL.md'283adding 'mcptoon-0.8.16.dist-info/licenses/LICENSE'284adding 'mcptoon-0.8.16.dist-info/licenses/NOTICE'285adding 'mcptoon-0.8.16.dist-info/METADATA'286adding 'mcptoon-0.8.16.dist-info/WHEEL'287adding 'mcptoon-0.8.16.dist-info/entry_points.txt'288adding 'mcptoon-0.8.16.dist-info/top_level.txt'289adding 'mcptoon-0.8.16.dist-info/RECORD'290removing build/bdist.linux-x86_64/wheel291Successfully built mcptoon-0.8.16-py3-none-any.whl292Finished creating a wheel...293Finished executing pypaBuildPhase
pythonRuntimeDepsCheckHook
294Executing pythonRuntimeDepsCheck295Checking runtime dependencies for mcptoon-0.8.16-py3-none-any.whl296Finished executing pythonRuntimeDepsCheck
installPhase
297Executing pypaInstallPhase298Successfully installed mcptoon-0.8.16-py3-none-any.whl299Finished executing pypaInstallPhase
pythonOutputDistPhase
300Executing pythonOutputDistPhase301Finished executing pythonOutputDistPhase
fixupPhase
302shrinking RPATHs of ELF executables and libraries in /nix/store/dj8saq4zdc1w9wbwnv89s1h4c7aljb6b-mcptoon-0.8.16303checking for references to /build/ in /nix/store/dj8saq4zdc1w9wbwnv89s1h4c7aljb6b-mcptoon-0.8.16...304patching script interpreter paths in /nix/store/dj8saq4zdc1w9wbwnv89s1h4c7aljb6b-mcptoon-0.8.16305stripping (with command strip and flags -S -p) in /nix/store/dj8saq4zdc1w9wbwnv89s1h4c7aljb6b-mcptoon-0.8.16/lib /nix/store/dj8saq4zdc1w9wbwnv89s1h4c7aljb6b-mcptoon-0.8.16/bin306shrinking RPATHs of ELF executables and libraries in /nix/store/cahg5n2dlrgngpw5yqsqvjq3ha17mcjj-mcptoon-0.8.16-dist307checking for references to /build/ in /nix/store/cahg5n2dlrgngpw5yqsqvjq3ha17mcjj-mcptoon-0.8.16-dist...308patching script interpreter paths in /nix/store/cahg5n2dlrgngpw5yqsqvjq3ha17mcjj-mcptoon-0.8.16-dist309Rewriting #!/nix/store/d64q19q1xjdwfhqx6czvrjgrhq0n3lcc-python3-3.14.7/bin/python3.14 to #!/nix/store/d64q19q1xjdwfhqx6czvrjgrhq0n3lcc-python3-3.14.7310wrapping `/nix/store/dj8saq4zdc1w9wbwnv89s1h4c7aljb6b-mcptoon-0.8.16/bin/mcptoon'...311Executing pythonRemoveTestsDir312Finished executing pythonRemoveTestsDir
installCheckPhase
313no Makefile or custom installCheckPhase, doing nothing
pythonImportsCheckPhase
314Executing pythonImportsCheckPhase315Check whether the following modules can be imported: mcptoon
pytestCheckPhase
316Executing pytestCheckPhase317pytest flags: -m pytest -k not\ \(test_search_registry_returns_list\)\ and\ not\ \(test_search_smithery_returns_list\)\ and\ not\ \(test_search_mcp_registry_returns_list\)\ and\ not\ \(test_packaged_path_resolves_to_the_copy_on_disk\)318============================= test session starts ==============================319platform linux -- Python 3.14.7, pytest-9.1.1, pluggy-1.6.0320rootdir: /build/source321configfile: pyproject.toml322testpaths: tests323collected 2007 items / 4 deselected / 2003 selected 324325tests/test_add_url_validation.py .............. [ 0%]326tests/test_bench.py ............. [ 1%]327tests/test_bench_tokens.py ....ss.. [ 1%]328tests/test_benchmark_repro.py sss........... [ 2%]329tests/test_cache.py .... [ 2%]330tests/test_calculator.py .......................... [ 3%]331tests/test_ccr.py ...................... [ 5%]332tests/test_ccr_http_session.py ....... [ 5%]333tests/test_ccr_lossless.py .......................... [ 6%]334tests/test_claude_plugin_package.py ............. [ 7%]335tests/test_cli_flags.py ................... [ 8%]336tests/test_cli_smoke.py ....... [ 8%]337tests/test_client.py .............................. [ 10%]338tests/test_command_coverage.py ......... [ 10%]339tests/test_completion.py ........... [ 11%]340tests/test_compressor.py .................................. [ 12%]341tests/test_config.py .................... [ 13%]342tests/test_dead_server_diagnostics.py ... [ 13%]343tests/test_demo.py ..................... [ 15%]344tests/test_demo_dead_package.py ........ [ 15%]345tests/test_demo_server.py .............................................. [ 17%]346..... [ 17%]347tests/test_discover.py .......................................F... [ 20%]348tests/test_docs.py .............................................. [ 22%]349tests/test_doctor_star_hint.py ....... [ 22%]350tests/test_envelope.py ........ [ 23%]351tests/test_exit_codes.py ......................... [ 24%]352tests/test_fallback_json.py ...... [ 24%]353tests/test_footer_broadcast.py ......................................... [ 26%]354.... [ 26%]355tests/test_footprint_claims.py ............ [ 27%]356tests/test_gemini_manifest.py ...... [ 27%]357tests/test_health.py .............. [ 28%]358tests/test_help_shortcircuit.py ......... [ 29%]359tests/test_honest_counts.py ................ [ 29%]360tests/test_http_user_agent.py ......... [ 30%]361tests/test_import.py ..................... [ 31%]362tests/test_installer_registry.py ................................. [ 32%]363tests/test_lang.py .............................. [ 34%]364tests/test_llms_txt.py ...... [ 34%]365tests/test_machine_readable_output.py .......................... [ 36%]366tests/test_native_tools.py ............................................. [ 38%]367........................ [ 39%]368tests/test_next_step_works.py ................. [ 40%]369tests/test_output.py ................................................... [ 42%]370........................................................................ [ 46%]371................ [ 47%]372tests/test_plugin_install.py .......... [ 47%]373tests/test_plugin_scan.py ............................... [ 49%]374tests/test_policy_overrides.py ................ [ 50%]375tests/test_presence.py ................................................. [ 52%]376............. [ 53%]377tests/test_readme_links.py ... [ 53%]378tests/test_registry_sync.py ............. [ 54%]379tests/test_report.py .............. [ 54%]380tests/test_reversible.py ............................................... [ 57%]381................... [ 58%]382tests/test_router.py .............................................. [ 60%]383tests/test_schema_call_e2e.py .. [ 60%]384tests/test_search.py ................................... [ 62%]385tests/test_serve.py .................................................... [ 64%]386.............. [ 65%]387tests/test_serve_perf.py .......... [ 65%]388tests/test_serve_prompts.py ........ [ 66%]389tests/test_skill_package.py ............................. [ 67%]390tests/test_skill_packs.py ................ [ 68%]391tests/test_skill_search.py .......... [ 69%]392tests/test_skills.py ................................................... [ 71%]393.....................ss................................................. [ 75%]394...................................... [ 77%]395tests/test_smart_compress_e2e.py .................. [ 78%]396tests/test_smart_reachability.py ..... [ 78%]397tests/test_source_tracked.py sss [ 78%]398tests/test_stats_toggle.py ......... [ 78%]399tests/test_stderr_pipe_deadlock.py .... [ 79%]400tests/test_sync.py ..................................................... [ 81%]401................................................... [ 84%]402tests/test_tier_claims_consistent.py .... [ 84%]403tests/test_toml_config.py .......................... [ 85%]404tests/test_toon_cross_validate.py ............................... [ 87%]405tests/test_uninstall_end_to_end.py .......... [ 87%]406tests/test_update.py .................... [ 88%]407tests/test_v02_features.py .................................... [ 90%]408tests/test_v04_features.py ................ [ 91%]409tests/test_v05_features.py ...................... [ 92%]410tests/test_v072_delight.py .....................s.. [ 93%]411tests/test_v073_http_security.py .............................. [ 95%]412tests/test_v074_stdio_timeout.py ............ [ 95%]413tests/test_v076_stateless_serve.py ................... [ 96%]414tests/test_v07_spec2026.py ..................... [ 97%]415tests/test_v081_env_headers.py ............. [ 98%]416tests/test_watch.py .................. [ 99%]417tests/test_xdg.py ............. [100%]418419=================================== FAILURES ===================================420____ TestPreferInstalledRunners.test_a_module_without_main_is_not_runnable _____421422self = <tests.test_discover.TestPreferInstalledRunners object at 0x7ffff50a7a80>423424 def test_a_module_without_main_is_not_runnable(self):425 """`json` resolves but has no `__main__`, so `python -m json` would die.426 427 Pin the real function (not a mock) against a stdlib module that is428 importable everywhere — this is the check that keeps a bare429 `find_spec(module)` from writing a dead server entry.430 """431> assert discover_mod._resolve_local_module("json") is None432E AssertionError: assert ['/nix/store/d64q19q1xjdwfhqx6czvrjgrhq0n3lcc-python3-3.14.7/bin/python3.14', '-m', 'json'] is None433E + where ['/nix/store/d64q19q1xjdwfhqx6czvrjgrhq0n3lcc-python3-3.14.7/bin/python3.14', '-m', 'json'] = <function _resolve_local_module at 0x7ffff51f7060>('json')434E + where <function _resolve_local_module at 0x7ffff51f7060> = discover_mod._resolve_local_module435436tests/test_discover.py:472: AssertionError437=========================== short test summary info ============================438FAILED tests/test_discover.py::TestPreferInstalledRunners::test_a_module_without_main_is_not_runnable - AssertionError: assert ['/nix/store/d64q19q1xjdwfhqx6czvrjgrhq0n3lcc-python...439===== 1 failed, 1991 passed, 11 skipped, 4 deselected in 78.83s (0:01:18) ======