setup
checks.x86_64-linux.pkgs-mcptoon
· build #7197
· raw
1these 2 derivations will be built:2 /nix/store/bi9dr3nijf8046md4avx47y02hrpxs38-mcptoon-0.8.16.drv3 /nix/store/lrzqdpml00rfv327v12bfb5xklkl92dq-check-mcptoon.drv4error: Cannot build '/nix/store/bi9dr3nijf8046md4avx47y02hrpxs38-mcptoon-0.8.16.drv'.5 Reason: builder failed with exit code 1.6 Output paths:7 /nix/store/cahg5n2dlrgngpw5yqsqvjq3ha17mcjj-mcptoon-0.8.16-dist8 /nix/store/dj8saq4zdc1w9wbwnv89s1h4c7aljb6b-mcptoon-0.8.169 Last 25 log lines:10 > tests/test_v081_env_headers.py ............. [ 98%]11 > tests/test_watch.py .................. [ 99%]12 > tests/test_xdg.py ............. [100%]13 >14 > =================================== FAILURES ===================================15 > ____ TestPreferInstalledRunners.test_a_module_without_main_is_not_runnable _____16 >17 > self = <tests.test_discover.TestPreferInstalledRunners object at 0x7ffff50a7a80>18 >19 > def test_a_module_without_main_is_not_runnable(self):20 > """`json` resolves but has no `__main__`, so `python -m json` would die.21 > 22 > Pin the real function (not a mock) against a stdlib module that is23 > importable everywhere — this is the check that keeps a bare24 > `find_spec(module)` from writing a dead server entry.25 > """26 > > assert discover_mod._resolve_local_module("json") is None27 > E AssertionError: assert ['/nix/store/d64q19q1xjdwfhqx6czvrjgrhq0n3lcc-python3-3.14.7/bin/python3.14', '-m', 'json'] is None28 > E + where ['/nix/store/d64q19q1xjdwfhqx6czvrjgrhq0n3lcc-python3-3.14.7/bin/python3.14', '-m', 'json'] = <function _resolve_local_module at 0x7ffff51f7060>('json')29 > E + where <function _resolve_local_module at 0x7ffff51f7060> = discover_mod._resolve_local_module30 >31 > tests/test_discover.py:472: AssertionError32 > =========================== short test summary info ============================33 > FAILED tests/test_discover.py::TestPreferInstalledRunners::test_a_module_without_main_is_not_runnable - AssertionError: assert ['/nix/store/d64q19q1xjdwfhqx6czvrjgrhq0n3lcc-python...34 > ===== 1 failed, 1991 passed, 11 skipped, 4 deselected in 82.41s (0:01:22) ======35 For full logs, run:36 nix log /nix/store/bi9dr3nijf8046md4avx47y02hrpxs38-mcptoon-0.8.16.drv37error: Cannot build '/nix/store/lrzqdpml00rfv327v12bfb5xklkl92dq-check-mcptoon.drv'.38 Reason: 1 dependency failed.39 Output paths:40 /nix/store/4wnyr1m30l9c9c3xlj1j225kvzyas18f-check-mcptoon