setup
checks.aarch64-darwin.pkgs-mcptoon
· build #7197
· raw
1these 2 derivations will be built:2 /nix/store/l7c95y70my1gmspihfzj8wwhix23p0pc-mcptoon-0.8.16.drv3 /nix/store/yp5qhmi94s82v9xpz7blw11fzdbnm8d7-check-mcptoon.drv4error: build of '/nix/store/l7c95y70my1gmspihfzj8wwhix23p0pc-mcptoon-0.8.16.drv' on 'grpc://farm.numtide.com:50051?client-cert=/run/secrets/vars/per-machine/bld1/nix-farm-ci/crt&client-key=/run/secrets/vars/per-machine/bld1/nix-farm-ci/key&connect-timeout=22&system=aarch64-darwin' failed: Cannot build '/nix/store/l7c95y70my1gmspihfzj8wwhix23p0pc-mcptoon-0.8.16.drv'.5 Reason: builder failed with exit code 1.6 Output paths:7 /nix/store/p9cnf4q9qfx7z5hlqvm1fpa9s89hlyk3-mcptoon-0.8.168 /nix/store/xrbxs33ywns6lyfqdrvsipzkfj2py2s7-mcptoon-0.8.16-dist9 Last 25 log lines:10 > tests/test_v081_env_headers.py ............. [ 98%]11 > tests/test_watch.py .................. [ 99%]12 > tests/test_xdg.py ............. [100%]13 >14 > =================================== FAILURES ===================================15 > ____ TestPreferInstalledRunners.test_a_module_without_main_is_not_runnable _____16 >17 > self = <tests.test_discover.TestPreferInstalledRunners object at 0x10b38fa80>18 >19 > def test_a_module_without_main_is_not_runnable(self):20 > """`json` resolves but has no `__main__`, so `python -m json` would die.21 > 22 > Pin the real function (not a mock) against a stdlib module that is23 > importable everywhere — this is the check that keeps a bare24 > `find_spec(module)` from writing a dead server entry.25 > """26 > > assert discover_mod._resolve_local_module("json") is None27 > E AssertionError: assert ['/nix/store/4l8r0s2r5fna7src82b5fc2hixdvfyw0-python3-3.14.7/bin/python3.14', '-m', 'json'] is None28 > E + where ['/nix/store/4l8r0s2r5fna7src82b5fc2hixdvfyw0-python3-3.14.7/bin/python3.14', '-m', 'json'] = <function _resolve_local_module at 0x10b2e2980>('json')29 > E + where <function _resolve_local_module at 0x10b2e2980> = discover_mod._resolve_local_module30 >31 > tests/test_discover.py:472: AssertionError32 > =========================== short test summary info ============================33 > FAILED tests/test_discover.py::TestPreferInstalledRunners::test_a_module_without_main_is_not_runnable - AssertionError: assert ['/nix/store/4l8r0s2r5fna7src82b5fc2hixdvfyw0-python...34 > ===== 1 failed, 1990 passed, 12 skipped, 4 deselected in 94.60s (0:01:34) ======35 For full logs, run:36 nix log /nix/store/l7c95y70my1gmspihfzj8wwhix23p0pc-mcptoon-0.8.16.drv37error: Cannot build '/nix/store/l7c95y70my1gmspihfzj8wwhix23p0pc-mcptoon-0.8.16.drv'.38 Reason: builder failed with exit code 1.39 Output paths:40 /nix/store/p9cnf4q9qfx7z5hlqvm1fpa9s89hlyk3-mcptoon-0.8.1641 /nix/store/xrbxs33ywns6lyfqdrvsipzkfj2py2s7-mcptoon-0.8.16-dist42error: Cannot build '/nix/store/yp5qhmi94s82v9xpz7blw11fzdbnm8d7-check-mcptoon.drv'.43 Reason: 1 dependency failed.44 Output paths:45 /nix/store/zacl9wb9y0h94dwfgmb9z47v9ljf88fz-check-mcptoon