setup
checks.aarch64-linux.pkgs-mcptoon
· build #7052
· raw
1these 2 derivations will be built:2 /nix/store/sps83sbs484kr6p5nn9n8w2z4105id6m-mcptoon-0.8.16.drv3 /nix/store/ia4hn7x040faprd0gbngps69wg31zpy4-check-mcptoon.drv4error: build of '/nix/store/sps83sbs484kr6p5nn9n8w2z4105id6m-mcptoon-0.8.16.drv' on 'grpc://farm.numtide.com:50051?client-cert=/run/secrets/vars/per-machine/bld1/nix-farm-ci/crt&client-key=/run/secrets/vars/per-machine/bld1/nix-farm-ci/key&connect-timeout=22&system=aarch64-linux' failed: Cannot build '/nix/store/sps83sbs484kr6p5nn9n8w2z4105id6m-mcptoon-0.8.16.drv'.5 Reason: builder failed with exit code 1.6 Output paths:7 /nix/store/1y4n5nib0figy247m5ycmll385q63kyb-mcptoon-0.8.16-dist8 /nix/store/667mnlw5y3gpk7wswq66wsixwvglvb9i-mcptoon-0.8.169 Last 25 log lines:10 > E + PROCESS_DIED11 >12 > tests/test_demo_dead_package.py:86: AssertionError13 > ____ TestPreferInstalledRunners.test_a_module_without_main_is_not_runnable _____14 >15 > self = <tests.test_discover.TestPreferInstalledRunners object at 0xfffff4af3a80>16 >17 > def test_a_module_without_main_is_not_runnable(self):18 > """`json` resolves but has no `__main__`, so `python -m json` would die.19 > 20 > Pin the real function (not a mock) against a stdlib module that is21 > importable everywhere — this is the check that keeps a bare22 > `find_spec(module)` from writing a dead server entry.23 > """24 > > assert discover_mod._resolve_local_module("json") is None25 > E AssertionError: assert ['/nix/store/3fl7bdkdxk2k4nssy1d1161isbzn6bsr-python3-3.14.7/bin/python3.14', '-m', 'json'] is None26 > E + where ['/nix/store/3fl7bdkdxk2k4nssy1d1161isbzn6bsr-python3-3.14.7/bin/python3.14', '-m', 'json'] = <function _resolve_local_module at 0xfffff4c43060>('json')27 > E + where <function _resolve_local_module at 0xfffff4c43060> = discover_mod._resolve_local_module28 >29 > tests/test_discover.py:472: AssertionError30 > =========================== short test summary info ============================31 > FAILED tests/test_dead_server_diagnostics.py::TestDiagnosticSurvivesTruncation::test_the_node_warning_is_not_the_headline - AssertionError: -1 == -1 : the diagnostic is missing entirely32 > FAILED tests/test_demo_dead_package.py::TestDeadServerStderrSurfaces::test_process_died_includes_stderr - AssertionError: 'RESPONSE_TIMEOUT' != 'PROCESS_DIED'33 > FAILED tests/test_discover.py::TestPreferInstalledRunners::test_a_module_without_main_is_not_runnable - AssertionError: assert ['/nix/store/3fl7bdkdxk2k4nssy1d1161isbzn6bsr-python...34 > ===== 3 failed, 1989 passed, 11 skipped, 4 deselected in 114.31s (0:01:54) =====35 For full logs, run:36 nix log /nix/store/sps83sbs484kr6p5nn9n8w2z4105id6m-mcptoon-0.8.16.drv37error: Cannot build '/nix/store/sps83sbs484kr6p5nn9n8w2z4105id6m-mcptoon-0.8.16.drv'.38 Reason: builder failed with exit code 1.39 Output paths:40 /nix/store/1y4n5nib0figy247m5ycmll385q63kyb-mcptoon-0.8.16-dist41 /nix/store/667mnlw5y3gpk7wswq66wsixwvglvb9i-mcptoon-0.8.1642error: Cannot build '/nix/store/ia4hn7x040faprd0gbngps69wg31zpy4-check-mcptoon.drv'.43 Reason: 1 dependency failed.44 Output paths:45 /nix/store/fpxl2b22hd5krvwxfd7mnibs7y1wkrs0-check-mcptoon