setup
checks.aarch64-linux.pkgs-mcptoon
· build #6838
· raw
1these 2 derivations will be built:2 /nix/store/wqzx0dpbdgx18cf3rngg9hm3gkicbqdr-mcptoon-0.8.15.drv3 /nix/store/cmimvmr6qzfnf1ivxyq0r0d0ywmgl6b3-check-mcptoon.drv4error: build of '/nix/store/wqzx0dpbdgx18cf3rngg9hm3gkicbqdr-mcptoon-0.8.15.drv' on 'grpc://farm.numtide.com:50051?client-cert=/run/secrets/vars/per-machine/bld1/nix-farm-ci/crt&client-key=/run/secrets/vars/per-machine/bld1/nix-farm-ci/key&connect-timeout=20&system=aarch64-linux' failed: Cannot build '/nix/store/wqzx0dpbdgx18cf3rngg9hm3gkicbqdr-mcptoon-0.8.15.drv'.5 Reason: builder failed with exit code 1.6 Output paths:7 /nix/store/ni29yja1cj5lc2xrcn1fyrz5msgk1b2h-mcptoon-0.8.158 /nix/store/s4h7r4gz4jyqvj6v1srsqvb8b8svxk23-mcptoon-0.8.15-dist9 Last 25 log lines:10 > tests/test_v07_spec2026.py ..................... [ 98%]11 > tests/test_v081_env_headers.py ............. [ 99%]12 > tests/test_watch.py .................. [100%]13 >14 > =================================== FAILURES ===================================15 > ____ TestPreferInstalledRunners.test_a_module_without_main_is_not_runnable _____16 >17 > self = <tests.test_discover.TestPreferInstalledRunners object at 0xfffff4ae3bb0>18 >19 > def test_a_module_without_main_is_not_runnable(self):20 > """`json` resolves but has no `__main__`, so `python -m json` would die.21 > 22 > Pin the real function (not a mock) against a stdlib module that is23 > importable everywhere — this is the check that keeps a bare24 > `find_spec(module)` from writing a dead server entry.25 > """26 > > assert discover_mod._resolve_local_module("json") is None27 > E AssertionError: assert ['/nix/store/3fl7bdkdxk2k4nssy1d1161isbzn6bsr-python3-3.14.7/bin/python3.14', '-m', 'json'] is None28 > E + where ['/nix/store/3fl7bdkdxk2k4nssy1d1161isbzn6bsr-python3-3.14.7/bin/python3.14', '-m', 'json'] = <function _resolve_local_module at 0xfffff4c32980>('json')29 > E + where <function _resolve_local_module at 0xfffff4c32980> = discover_mod._resolve_local_module30 >31 > tests/test_discover.py:472: AssertionError32 > =========================== short test summary info ============================33 > FAILED tests/test_discover.py::TestPreferInstalledRunners::test_a_module_without_main_is_not_runnable - AssertionError: assert ['/nix/store/3fl7bdkdxk2k4nssy1d1161isbzn6bsr-python...34 > ===== 1 failed, 1932 passed, 11 skipped, 4 deselected in 83.03s (0:01:23) ======35 For full logs, run:36 nix log /nix/store/wqzx0dpbdgx18cf3rngg9hm3gkicbqdr-mcptoon-0.8.15.drv37error: Cannot build '/nix/store/wqzx0dpbdgx18cf3rngg9hm3gkicbqdr-mcptoon-0.8.15.drv'.38 Reason: builder failed with exit code 1.39 Output paths:40 /nix/store/ni29yja1cj5lc2xrcn1fyrz5msgk1b2h-mcptoon-0.8.1541 /nix/store/s4h7r4gz4jyqvj6v1srsqvb8b8svxk23-mcptoon-0.8.15-dist42error: Cannot build '/nix/store/cmimvmr6qzfnf1ivxyq0r0d0ywmgl6b3-check-mcptoon.drv'.43 Reason: 1 dependency failed.44 Output paths:45 /nix/store/yzabhfqdg2hcx7sa89qcnb7rfhqql52z-check-mcptoon