setup
checks.aarch64-darwin.pkgs-mcptoon
· build #6838
· raw
1these 3 derivations will be built:2 /nix/store/asski7lz6b31l64zjak3hbklnvfg5w4x-source.drv3 /nix/store/3i23x9i5xy5y5399rfqy39kqw2v954if-mcptoon-0.8.15.drv4 /nix/store/ngs454pkd4z7ryjp2dqnk94na7r12psk-check-mcptoon.drv5error: build of '/nix/store/3i23x9i5xy5y5399rfqy39kqw2v954if-mcptoon-0.8.15.drv' on 'grpc://farm.numtide.com:50051?client-cert=/run/secrets/vars/per-machine/bld1/nix-farm-ci/crt&client-key=/run/secrets/vars/per-machine/bld1/nix-farm-ci/key&connect-timeout=22&system=aarch64-darwin' failed: Cannot build '/nix/store/3i23x9i5xy5y5399rfqy39kqw2v954if-mcptoon-0.8.15.drv'.6 Reason: builder failed with exit code 1.7 Output paths:8 /nix/store/117adjfwiv5kq4821gcmq8xjr2k0fxnm-mcptoon-0.8.15-dist9 /nix/store/fk9n15jhj206aw75s7g2kpvh8nvf265b-mcptoon-0.8.1510 Last 25 log lines:11 > tests/test_v07_spec2026.py ..................... [ 98%]12 > tests/test_v081_env_headers.py ............. [ 99%]13 > tests/test_watch.py .................. [100%]14 >15 > =================================== FAILURES ===================================16 > ____ TestPreferInstalledRunners.test_a_module_without_main_is_not_runnable _____17 >18 > self = <tests.test_discover.TestPreferInstalledRunners object at 0x109443bb0>19 >20 > def test_a_module_without_main_is_not_runnable(self):21 > """`json` resolves but has no `__main__`, so `python -m json` would die.22 > 23 > Pin the real function (not a mock) against a stdlib module that is24 > importable everywhere — this is the check that keeps a bare25 > `find_spec(module)` from writing a dead server entry.26 > """27 > > assert discover_mod._resolve_local_module("json") is None28 > E AssertionError: assert ['/nix/store/4l8r0s2r5fna7src82b5fc2hixdvfyw0-python3-3.14.7/bin/python3.14', '-m', 'json'] is None29 > E + where ['/nix/store/4l8r0s2r5fna7src82b5fc2hixdvfyw0-python3-3.14.7/bin/python3.14', '-m', 'json'] = <function _resolve_local_module at 0x109397e20>('json')30 > E + where <function _resolve_local_module at 0x109397e20> = discover_mod._resolve_local_module31 >32 > tests/test_discover.py:472: AssertionError33 > =========================== short test summary info ============================34 > FAILED tests/test_discover.py::TestPreferInstalledRunners::test_a_module_without_main_is_not_runnable - AssertionError: assert ['/nix/store/4l8r0s2r5fna7src82b5fc2hixdvfyw0-python...35 > ===== 1 failed, 1931 passed, 12 skipped, 4 deselected in 89.25s (0:01:29) ======36 For full logs, run:37 nix log /nix/store/3i23x9i5xy5y5399rfqy39kqw2v954if-mcptoon-0.8.15.drv38error: Cannot build '/nix/store/3i23x9i5xy5y5399rfqy39kqw2v954if-mcptoon-0.8.15.drv'.39 Reason: builder failed with exit code 1.40 Output paths:41 /nix/store/117adjfwiv5kq4821gcmq8xjr2k0fxnm-mcptoon-0.8.15-dist42 /nix/store/fk9n15jhj206aw75s7g2kpvh8nvf265b-mcptoon-0.8.1543error: Cannot build '/nix/store/ngs454pkd4z7ryjp2dqnk94na7r12psk-check-mcptoon.drv'.44 Reason: 1 dependency failed.45 Output paths:46 /nix/store/w1bdcdzg5g4vrpz2y9dpl69k79nfh08m-check-mcptoon