numtide/llm-agents.nix build #6820 failed ← #6819 #6821 →
7 failed
| status | attribute | duration |
|---|---|---|
checks.aarch64-darwin.pkgs-clauth
|
52m 17s | |
clauth-0.16.0: thread 'runtime::tests::prune_with_two_live_sessions_returns_two' (85654511) panicked at src/../tests/inline/runtime.rs:4701:5: assertion `left = …clauth-0.16.0:
thread 'runtime::tests::prune_with_two_live_sessions_returns_two' (85654511) panicked at src/../tests/inline/runtime.rs:4701:5:
assertion `left == right` failed: one live session after f2 dropped
left: 2
right: 1
failures:
runtime::tests::prune_with_two_live_sessions_returns_two
test result: FAILED. 4191 passed; 1 failed; 11 ignored; 0 measured; 12 filtered out; finished in 541.22s
error: test failed, to rerun pass `--bin clauth`
|
||
checks.aarch64-linux.pkgs-codex
|
57m 49s | |
codex-0.160.1: = note: `#[warn(unused_imports)]` (part of `#[warn(unused)]`) on by default warning: unused import: `codex_http_client::OutboundProxyPolicy` …codex-0.160.1: = note: `#[warn(unused_imports)]` (part of `#[warn(unused)]`) on by default warning: unused import: `codex_http_client::OutboundProxyPolicy` --> cloud-tasks/src/lib.rs:17:5 | 17 | use codex_http_client::OutboundProxyPolicy; | ^^^^^^^^^^^^^^^^^^^^^^^^^^^^^^^^^^^^^^ warning: `codex-cloud-tasks` (lib) generated 2 warnings (run `cargo fix --lib -p codex-cloud-tasks` to apply 2 suggestions) warning: `codex-app-server` (lib) generated 1 warning (run `cargo fix --lib -p codex-app-server` to apply 1 suggestion) |
||
checks.aarch64-linux.pkgs-mcptoon
|
3m 42s | |
mcptoon-0.8.14: # that the package is missing. Either the warning is dropped entirely, # or the diagnostic leads. > self.assertNotEqual(np …mcptoon-0.8.14:
# that the package is missing. Either the warning is dropped entirely,
# or the diagnostic leads.
> self.assertNotEqual(npm_at, -1, "the diagnostic is missing entirely")
E AssertionError: -1 == -1 : the diagnostic is missing entirely
tests/test_dead_server_diagnostics.py:103: AssertionError
=========================== short test summary info ============================
FAILED tests/test_dead_server_diagnostics.py::TestDiagnosticSurvivesTruncation::test_the_node_warning_is_not_the_headline - AssertionError: -1 == -1 : the diagnostic is missing entirely
===== 1 failed, 1908 passed, 11 skipped, 4 deselected in 145.78s (0:02:25) =====
|
||
checks.aarch64-linux.pkgs-oh-my-codex
|
1h 36m | |
codex-0.160.1: thread 'main' (21636) panicked at cargo-auditable/src/rustc_wrapper.rs:35:10: rustc was terminated by a deadly signal note: run with `RUST_BACKTR …codex-0.160.1: thread 'main' (21636) panicked at cargo-auditable/src/rustc_wrapper.rs:35:10: rustc was terminated by a deadly signal note: run with `RUST_BACKTRACE=1` environment variable to display a backtrace warning: `codex-core` (lib) generated 1 warning (run `cargo fix --lib -p codex-core` to apply 1 suggestion) error: could not compile `codex-core` (lib); 1 warning emitted Caused by: process didn't exit successfully: `/nix/store/q4pldizjjvsm7mrg66hln22da8rxj01a-cargo-auditable-0.7.5/bin/cargo-auditable rustc --crate-name codex_core --edition=2024 core/src/lib.rs --error-format=json --json=diagnostic-rendered-ansi,artifacts,future-incompat --crate-type lib --emit=dep-info,metadata,link -C opt-level=3 -C embed-bitcode=no '--deny=clippy::unwrap_used' '--deny=clippy::unnecessary_to_owned' '--deny=clippy::unnecessary_sort_by' '--deny=clippy::unnecessary_lazy_evaluations' '--deny=clippy::unnecessary_filter_map' '--deny=clippy::uninlined_format_args' '--deny=clippy::trivially_copy_pass_by_ref' '--deny=clippy::redundant_static… warning: `codex-app-server` (lib) generated 1 warning (run `cargo fix --lib -p codex-app-server` to apply 1 suggestion) |
||
checks.x86_64-linux.pkgs-codex
|
1h 4m | |
setup: these 2 derivations will be built: /nix/store/gxay3j5308cz8gq7wr8wl017nwk08vb9-codex-0.160.1.drv /nix/store/jynwlsnk2cd08h4zwgwrbkjkvq1m95zs-check-co …setup: these 2 derivations will be built: /nix/store/gxay3j5308cz8gq7wr8wl017nwk08vb9-codex-0.160.1.drv /nix/store/jynwlsnk2cd08h4zwgwrbkjkvq1m95zs-check-codex.drv this path will be fetched (247.0 MiB download, 1.6 GiB unpacked): /nix/store/h2xl09apzvvajl8iv7nvpfhs6wf2lgcv-codex-0.160.1-vendor error: timed out after 1200 seconds error: Cannot build '/nix/store/jynwlsnk2cd08h4zwgwrbkjkvq1m95zs-check-codex.drv'. Reason: 1 dependency failed. Output paths: /nix/store/l4yggk38krfza8phpg93hmrd5fhm5448-check-codex |
||
checks.x86_64-linux.pkgs-funes
|
31m 47s | |
setup: these 3 derivations will be built: /nix/store/sf3bak704ayqfyw2bbjz8x6fy2wm357j-funes-1.6.0-vendor.drv /nix/store/2zm4hdld5cv14j5x0lxfryv2p8zcnxmb-fun …setup: these 3 derivations will be built: /nix/store/sf3bak704ayqfyw2bbjz8x6fy2wm357j-funes-1.6.0-vendor.drv /nix/store/2zm4hdld5cv14j5x0lxfryv2p8zcnxmb-funes-1.6.0.drv /nix/store/ipkq9yr99y612qigvpr6aj8x4isy2645-check-funes.drv error: timed out after 1200 seconds error: Cannot build '/nix/store/ipkq9yr99y612qigvpr6aj8x4isy2645-check-funes.drv'. Reason: 1 dependency failed. Output paths: /nix/store/gc90qyk6vc0il1rvr218ycdx5hqwyi4z-check-funes |
||
checks.x86_64-linux.pkgs-voxterm
|
38m 5s | |
python3.14-torchcodec-0.16.0: FAILED test/test_encoders.py::TestEncoder::test_audio_against_cli[to_file-mp3-8000-None-0-asset1] - AssertionError: Tensor-likes a …python3.14-torchcodec-0.16.0: FAILED test/test_encoders.py::TestEncoder::test_audio_against_cli[to_file-mp3-8000-None-0-asset1] - AssertionError: Tensor-likes are not close! FAILED test/test_encoders.py::TestEncoder::test_audio_against_cli[to_file-mp3-8000-1-None-asset1] - AssertionError: Tensor-likes are not close! FAILED test/test_encoders.py::TestEncoder::test_audio_against_cli[to_file-mp3-8000-1-0-asset1] - AssertionError: Tensor-likes are not close! FAILED test/test_encoders.py::TestEncoder::test_audio_against_cli[to_file_like-mp3-8000-None-None-asset1] - AssertionError: Tensor-likes are not close! FAILED test/test_encoders.py::TestEncoder::test_audio_against_cli[to_file_like-mp3-8000-None-0-asset1] - AssertionError: Tensor-likes are not close! FAILED test/test_encoders.py::TestEncoder::test_audio_against_cli[to_file_like-mp3-8000-1-None-asset1] - AssertionError: Tensor-likes are not close! FAILED test/test_encoders.py::TestEncoder::test_audio_against_cli[to_file_like-mp3-8000-1-0-asset1] - AssertionError: Tensor-likes are not close! = 8 failed, 1935 passed, 737 skipped, 1 deselected, 5 warnings in 2057.83s (0:34:17) = |
||
260 succeeded ⚠ 3
354 already built
| status | attribute | duration |
|---|---|---|
| loading… | ||