these 2 derivations will be built: /nix/store/8r1bc9jkl04bf1gs23ck8f7zj20ic4x4-aven-0.1.46.drv /nix/store/bjj125xx4fhw4h2w1d3myhg06s4vvnrn-check-aven.drv building '/nix/store/8r1bc9jkl04bf1gs23ck8f7zj20ic4x4-aven-0.1.46.drv' aven-0.1.46> Using versionCheckHook aven-0.1.46> Running phase: unpackPhase aven-0.1.46> unpacking source archive /nix/store/gkc2z0dnql3yc4v9czppbb7mzdpbqqiq-source aven-0.1.46> source root is source aven-0.1.46> Executing cargoSetupPostUnpackHook aven-0.1.46> Finished cargoSetupPostUnpackHook aven-0.1.46> Running phase: patchPhase aven-0.1.46> applying patch /nix/store/ly5lhdxax9l9307l5pibhip820xznj5b-daemon-status-unknown-without-gui-domain.patch aven-0.1.46> patching file src/daemon/service.rs aven-0.1.46> Hunk #1 FAILED at 240. aven-0.1.46> 1 out of 1 hunk FAILED -- saving rejects to file src/daemon/service.rs.rej error: Cannot build '/nix/store/8r1bc9jkl04bf1gs23ck8f7zj20ic4x4-aven-0.1.46.drv'. Reason: builder failed with exit code 1. Output paths: /nix/store/rp69wm1vbzm7pcf3ndjfa2ipslzmvzck-aven-0.1.46 Last 11 log lines: > Using versionCheckHook > Running phase: unpackPhase > unpacking source archive /nix/store/gkc2z0dnql3yc4v9czppbb7mzdpbqqiq-source > source root is source > Executing cargoSetupPostUnpackHook > Finished cargoSetupPostUnpackHook > Running phase: patchPhase > applying patch /nix/store/ly5lhdxax9l9307l5pibhip820xznj5b-daemon-status-unknown-without-gui-domain.patch > patching file src/daemon/service.rs > Hunk #1 FAILED at 240. > 1 out of 1 hunk FAILED -- saving rejects to file src/daemon/service.rs.rej For full logs, run: nix log /nix/store/8r1bc9jkl04bf1gs23ck8f7zj20ic4x4-aven-0.1.46.drv error: Cannot build '/nix/store/bjj125xx4fhw4h2w1d3myhg06s4vvnrn-check-aven.drv'. Reason: 1 dependency failed. Output paths: /nix/store/8p8ywn949jivmh4pykhc4dn1clmd834m-check-aven