kandev-0.97.0
checks.x86_64-linux.pkgs-kandev
· build #6686
· raw
1Using versionCheckHook
unpackPhase
2unpacking source archive /nix/store/z0fnw2vsb8ax2gwlmqspg34gk96vi6vh-source3source root is sourcepatchPhase
4applying patch /nix/store/58lyy1i35l7fyj60lrd130jd2cvr2rxq-prefer-native-acp-runtimes.patch5patching file apps/backend/internal/agent/agents/copilot_acp.go6patching file apps/backend/internal/agent/agents/copilot_acp_test.go7patching file apps/backend/internal/agent/agents/droid_acp.go8patching file apps/backend/internal/agent/agents/gemini.go9patching file apps/backend/internal/agent/agents/kilocode_acp.go10patching file apps/backend/internal/agent/agents/native_binary_agents_test.go11patching file apps/backend/internal/agent/agents/qwen_acp.go12patching file apps/backend/internal/agent/hostutility/manager.go13Hunk #1 succeeded at 7 (offset 2 lines).14Hunk #2 succeeded at 26 (offset 2 lines).15Hunk #3 FAILED at 840.161 out of 3 hunks FAILED -- saving rejects to file apps/backend/internal/agent/hostutility/manager.go.rej17patching file apps/backend/internal/agent/hostutility/native_binary_test.go18patching file apps/backend/internal/agent/registry/provider.go19Hunk #2 succeeded at 134 (offset 8 lines).20patching file apps/backend/internal/agent/runtime/lifecycle/manager_launch.go21Hunk #1 succeeded at 711 (offset 102 lines).22patching file apps/backend/internal/agent/runtime/lifecycle/manager_launch_test.go23patching file apps/backend/internal/agent/runtime/lifecycle/utility.go24Hunk #2 succeeded at 80 (offset 3 lines).25Hunk #3 FAILED at 89.26Hunk #4 FAILED at 172.272 out of 4 hunks FAILED -- saving rejects to file apps/backend/internal/agent/runtime/lifecycle/utility.go.rej28patching file apps/backend/internal/agent/runtime/lifecycle/utility_test.go29patching file apps/backend/internal/agent/settings/controller/agent_config.go30patching file apps/backend/internal/agent/settings/controller/controller_test.go31patching file apps/backend/internal/agentctl/server/utility/acp_executor.go32Hunk #1 succeeded at 1294 with fuzz 2 (offset 51 lines).33Hunk #2 succeeded at 1311 (offset 52 lines).34patching file apps/backend/internal/agentctl/server/utility/probe_allowlist_test.go